WebDriverAgent failed to build: Assign property / Could not build RoutingHTTPServer

Hi all, how can I solve this problem? I can’t configure ios

slowly, please

@fap

Please follow this instruction: https://docs.katalon.com/katalon-studio/docs/installing-webdriveragent-for-ios-devices.html

I know them very well. updated the path in documentation, since appium 1.15 has changed, you have made me crazy.

Appium 1.12.1 or appium 1.13.0 is your friend here.

Thanks

also appium 1.12 or 1.13 i have the same error, webdriverangent build failed

11:24:36.332 xcodebuild[3698:54840] Started session with 00008020-00140D5A3686002E
11:24:36.332 xcodebuild[3698:54840] Requesting (with session) 00008020-00140D5A3686002E: <DTDKCopyValueRequest: 0x7fa5f1230250> { domain: (null), key: PasswordProtected}
11:24:36.334 xcodebuild[3698:54840] Request succeeded 00008020-00140D5A3686002E: <DTDKCopyValueRequest: 0x7fa5f1230250> { domain: (null), key: PasswordProtected} (1)
11:24:36.334 xcodebuild[3698:54840] Ending session with 00008020-00140D5A3686002E
11:33:32.079 WebDriverAgentRunner-Runner[2004:624400] Handling kAXPidStatusChangedNotification
11:33:32.079 WebDriverAgentRunner-Runner[2004:624400] Got kAXPidStatusChangedNotification for 403: active
11:33:32.080 WebDriverAgentRunner-Runner[2004:624400] Handling kAXPidStatusChangedNotification
11:33:32.080 WebDriverAgentRunner-Runner[2004:624400] Got kAXPidStatusChangedNotification for 1277: active
11:33:32.093 WebDriverAgentRunner-Runner[2004:624664] Handling kAXUserTestingNotification
11:33:32.093 WebDriverAgentRunner-Runner[2004:624664] Handling kAXUserTestingNotification
11:33:32.101 WebDriverAgentRunner-Runner[2004:624400] Handling kAXUserTestingNotification
11:33:32.101 WebDriverAgentRunner-Runner[2004:624400] Handling kAXUserTestingNotification
11:33:32.102 WebDriverAgentRunner-Runner[2004:624400] Handling kAXUserTestingNotification
11:33:32.156 WebDriverAgentRunner-Runner[2004:624664] Handling kAXUserTestingNotification
11:33:32.175 WebDriverAgentRunner-Runner[2004:624664] Handling kAXUserTestingNotification
11:33:32.176 WebDriverAgentRunner-Runner[2004:624664] Handling kAXUserTestingNotification
11:33:32.238 WebDriverAgentRunner-Runner[2004:624664] Handling kAXUserTestingNotification
11:33:32.238 WebDriverAgentRunner-Runner[2004:624664] Handling kAXUserTestingNotification
11:33:32.239 WebDriverAgentRunner-Runner[2004:624664] Handling kAXUserTestingNotification
11:33:32.265 WebDriverAgentRunner-Runner[2004:624664] Handling kAXUserTestingNotification
11:33:32.265 WebDriverAgentRunner-Runner[2004:624664] Handling kAXUserTestingNotification
11:33:32.266 WebDriverAgentRunner-Runner[2004:624664] Handling kAXUserTestingNotification
11:33:33.565 WebDriverAgentRunner-Runner[2004:624368] No application process found matching pid 403, caching
11:33:33.566 WebDriverAgentRunner-Runner[2004:624368] No application process found matching pid 1277, caching

… … … … … … … … jluljnkjjlnjhoinlnjlnhj

Failed _shouldMakeReadyForDevelopment check even though device is not locked by passcode."

One of the two will be used. Which one is undefined.
Test Suite ‘All tests’ started at 2019-10-01 09:56:32.974
Test Suite ‘WebDriverAgentRunner.xctest’ started at 2019-10-01 09:56:32.974
Test Suite ‘UITestingUITests’ started at 2019-10-01 09:56:32.975
Test Case ‘-[UITestingUITests testRunner]’ started.
t = 0.00s Start Test at 2019-10-01 09:56:32.988
t = 0.00s Set Up
2019-10-01 09:56:33.035465+0200 WebDriverAgentRunner-Runner[866:90065] Built at Oct 1 2019 09:52:03
2019-10-01 09:56:33.093848+0200 WebDriverAgentRunner-Runner[866:90065] ServerURLHere->http://192.168.1.44:8100<-ServerURLHere
2019-10-01 09:56:33.095143+0200 WebDriverAgentRunner-Runner[866:90222] Using singleton test manager
error in connection_block_invoke_2: Connection interrupted

hi, I try to launch an application on a xcode simulator ios, but katalon remains in the “starting application” and the application is never launched. does anyone have launched an app on katalon with simulator or real device? because from what I read I see only people who don’t work, who have problem with ios in katalon.

@fap

Did you install dependencies for iOS Mobile test?

xcodebuild -project WebDriverAgent.xcodeproj -scheme WebDriverAgentRunner -destination 'id=<udid>' test

is not required, you can bypass this step.

Thanks

@duyluong, yes i have installed all dependencies, but not works:

  1. physical device is not present in katalon

  2. simulator is blocked at “starting application”

failed to launch com.name.app application

java.util.concurrent.ExecutionException: org.openqa.selenium.SessionNotCreatedException: Unable to create a new remote session. Original error: unexpected end of stream on Connection{127.0.0.1:60376, proxy=DIRECT hostAddress=/127.0.0.1:60376 cipherSuite=none protocol=http/1.1}

@duyluong

java.util.concurrent.ExecutionException: org.openqa.selenium.SessionNotCreatedException: Unable to create a new remote session. Please check the server log for more details. Original error: An unknown server-side error occurred while processing the command. Original error: Unable to start WebDriverAgent session because of xcodebuild failure: An unknown server-side error occurred while processing the command. Original error: Could not proxy command to remote server. Original error: Error: connect ECONNREFUSED 127.0.0.1:60768

@duyluong

java.util.concurrent.ExecutionException: org.openqa.selenium.SessionNotCreatedException: Unable to create a new remote session. Original error: unexpected end of stream on Connection{127.0.0.1:61176, proxy=DIRECT hostAddress=/127.0.0.1:61176 cipherSuite=none protocol=http/1.1}

Build info: version: ‘unknown’, revision: ‘unknown’, time: ‘unknown’

thanks great community.