WebDriverAgent Error 65

MacOS version: Catalina 10.15.7
iOS device model and version: iPhone X , iOS 14.3
Katalon version: 8.1.0
Appium version: 1.22.0
XCode version: 12.4 (12D4e)

When attempting to use Katalon on my iOS device, I receive an Error 65:
java.util.concurrent.ExecutionException: org.openqa.selenium.SessionNotCreatedException: Unable to create a new remote session. Please check the server log for more details. Original error: An unknown server-side error occurred while processing the command. Original error: Unable to launch WebDriverAgent because of xcodebuild failure: xcodebuild failed with code 65
xcodebuild error message:
. Make sure you follow the tutorial at https://github.com/appium/appium-xcuitest-driver/blob/master/docs/real-device-config.md. Try to remove the WebDriverAgentRunner application from the device if it is installed and reboot the device.

The setup instructions I followed are on the following webpages:


And:

The issue is that building in XCode is impossible (Step 5 of the WebDriverAgent Setup) because “com.facebook.IntegrationApp cannot be registered to your development team because it is not available.”

Renaming “com.facebook.IntegrationApp” to something else causes the errors to disappear and the build to succeed, but no WebDriverAgent application appears on the iPhone and error 65 still occurs when attempting Mobile Spy.

I have attempted the tutorial written in the error message itself:

I have also attempted the steps in the following web guides and videos with no success:


Thank you in advance for any assistance.

Screenshots for the XCode Error and the desired capabilities on Katalon:


Here is the Appium log that appears on Katalon with error 65:

java.util.concurrent.ExecutionException: org.openqa.selenium.SessionNotCreatedException: Unable to create a new remote session. Please check the server log for more details. Original error: An unknown server-side error occurred while processing the command. Original error: Unable to launch WebDriverAgent because of xcodebuild failure: xcodebuild failed with code 65
xcodebuild error message:
. Make sure you follow the tutorial at https://github.com/appium/appium-xcuitest-driver/blob/master/docs/real-device-config.md. Try to remove the WebDriverAgentRunner application from the device if it is installed and reboot the device.
Build info: version: ‘unknown’, revision: ‘unknown’, time: ‘unknown’
System info: host: ‘Softs-Mac-mini-4.local’, ip: ‘127.0.0.1’, os.name: ‘Mac OS X’, os.arch: ‘x86_64’, os.version: ‘10.15.7’, java.version: ‘1.8.0_275’
Driver info: driver.version: IOSDriver
remote stacktrace: UnknownError: An unknown server-side error occurred while processing the command. Original error: Unable to launch WebDriverAgent because of xcodebuild failure: xcodebuild failed with code 65
xcodebuild error message:
. Make sure you follow the tutorial at https://github.com/appium/appium-xcuitest-driver/blob/master/docs/real-device-config.md. Try to remove the WebDriverAgentRunner application from the device if it is installed and reboot the device.
at getResponseForW3CError (/usr/local/lib/node_modules/appium/node_modules/appium-base-driver/lib/protocol/errors.js:804:9)
at asyncHandler (/usr/local/lib/node_modules/appium/node_modules/appium-base-driver/lib/protocol/protocol.js:380:37)
at runNextTicks (node:internal/process/task_queues:61:5)
at processImmediate (node:internal/timers:437:9)
Build info: version: ‘unknown’, revision: ‘unknown’, time: ‘unknown’
System info: host: ‘Softs-Mac-mini-4.local’, ip: ‘127.0.0.1’, os.name: ‘Mac OS X’, os.arch: ‘x86_64’, os.version: ‘10.15.7’, java.version: ‘1.8.0_275’
Driver info: driver.version: IOSDriver
at com.kms.katalon.composer.components.impl.dialogs.ProgressMonitorDialogWithThread.runAndWait(ProgressMonitorDialogWithThread.java:49)
at com.kms.katalon.composer.mobile.objectspy.components.MobileLocalAppComposite$12.run(MobileLocalAppComposite.java:474)
at org.eclipse.jface.operation.ModalContext$ModalContextThread.run(ModalContext.java:122)
Caused by: org.openqa.selenium.SessionNotCreatedException: Unable to create a new remote session. Please check the server log for more details. Original error: An unknown server-side error occurred while processing the command. Original error: Unable to launch WebDriverAgent because of xcodebuild failure: xcodebuild failed with code 65
xcodebuild error message:
. Make sure you follow the tutorial at https://github.com/appium/appium-xcuitest-driver/blob/master/docs/real-device-config.md. Try to remove the WebDriverAgentRunner application from the device if it is installed and reboot the device.
Build info: version: ‘unknown’, revision: ‘unknown’, time: ‘unknown’
System info: host: ‘Softs-Mac-mini-4.local’, ip: ‘127.0.0.1’, os.name: ‘Mac OS X’, os.arch: ‘x86_64’, os.version: ‘10.15.7’, java.version: ‘1.8.0_275’
Driver info: driver.version: IOSDriver
remote stacktrace: UnknownError: An unknown server-side error occurred while processing the command. Original error: Unable to launch WebDriverAgent because of xcodebuild failure: xcodebuild failed with code 65
xcodebuild error message:
. Make sure you follow the tutorial at https://github.com/appium/appium-xcuitest-driver/blob/master/docs/real-device-config.md. Try to remove the WebDriverAgentRunner application from the device if it is installed and reboot the device.
at getResponseForW3CError (/usr/local/lib/node_modules/appium/node_modules/appium-base-driver/lib/protocol/errors.js:804:9)
at asyncHandler (/usr/local/lib/node_modules/appium/node_modules/appium-base-driver/lib/protocol/protocol.js:380:37)
at runNextTicks (node:internal/process/task_queues:61:5)
at processImmediate (node:internal/timers:437:9)
Build info: version: ‘unknown’, revision: ‘unknown’, time: ‘unknown’
System info: host: ‘Softs-Mac-mini-4.local’, ip: ‘127.0.0.1’, os.name: ‘Mac OS X’, os.arch: ‘x86_64’, os.version: ‘10.15.7’, java.version: ‘1.8.0_275’
Driver info: driver.version: IOSDriver
at io.appium.java_client.remote.AppiumCommandExecutor$1.createSession(AppiumCommandExecutor.java:208)
at io.appium.java_client.remote.AppiumCommandExecutor.createSession(AppiumCommandExecutor.java:217)
at io.appium.java_client.remote.AppiumCommandExecutor.execute(AppiumCommandExecutor.java:239)
at org.openqa.selenium.remote.RemoteWebDriver.execute(RemoteWebDriver.java:552)
at io.appium.java_client.DefaultGenericMobileDriver.execute(DefaultGenericMobileDriver.java:42)
at io.appium.java_client.AppiumDriver.execute(AppiumDriver.java:1)
at io.appium.java_client.ios.IOSDriver.execute(IOSDriver.java:1)
at org.openqa.selenium.remote.RemoteWebDriver.startSession(RemoteWebDriver.java:213)
at org.openqa.selenium.remote.RemoteWebDriver.(RemoteWebDriver.java:131)
at io.appium.java_client.DefaultGenericMobileDriver.(DefaultGenericMobileDriver.java:38)
at io.appium.java_client.AppiumDriver.(AppiumDriver.java:84)
at io.appium.java_client.ios.IOSDriver.(IOSDriver.java:85)
at com.kms.katalon.core.appium.driver.AppiumDriverManager.createMobileDriver(AppiumDriverManager.java:496)
at com.kms.katalon.core.appium.driver.AppiumDriverManager.createMobileDriver(AppiumDriverManager.java:480)
at com.kms.katalon.core.mobile.keyword.internal.MobileDriverFactory.startLocalMobileDriver(MobileDriverFactory.java:539)
at com.kms.katalon.composer.mobile.objectspy.dialog.MobileInspectorController.startMobileApp(MobileInspectorController.java:196)
at com.kms.katalon.composer.mobile.objectspy.components.MobileLocalAppComposite$12$1.call(MobileLocalAppComposite.java:479)
at com.kms.katalon.composer.components.impl.dialogs.ProgressMonitorDialogWithThread.startThreadAndWait(ProgressMonitorDialogWithThread.java:36)
at com.kms.katalon.composer.components.impl.dialogs.ProgressMonitorDialogWithThread.runAndWait(ProgressMonitorDialogWithThread.java:48)
… 2 more
Caused by: java.lang.reflect.InvocationTargetException
at io.appium.java_client.remote.AppiumCommandExecutor$1.createSession(AppiumCommandExecutor.java:186)
… 20 more
Caused by: org.openqa.selenium.WebDriverException: An unknown server-side error occurred while processing the command. Original error: Unable to launch WebDriverAgent because of xcodebuild failure: xcodebuild failed with code 65
xcodebuild error message:
. Make sure you follow the tutorial at https://github.com/appium/appium-xcuitest-driver/blob/master/docs/real-device-config.md. Try to remove the WebDriverAgentRunner application from the device if it is installed and reboot the device.
Build info: version: ‘unknown’, revision: ‘unknown’, time: ‘unknown’
System info: host: ‘Softs-Mac-mini-4.local’, ip: ‘127.0.0.1’, os.name: ‘Mac OS X’, os.arch: ‘x86_64’, os.version: ‘10.15.7’, java.version: ‘1.8.0_275’
Driver info: driver.version: IOSDriver
remote stacktrace: UnknownError: An unknown server-side error occurred while processing the command. Original error: Unable to launch WebDriverAgent because of xcodebuild failure: xcodebuild failed with code 65
xcodebuild error message:
. Make sure you follow the tutorial at https://github.com/appium/appium-xcuitest-driver/blob/master/docs/real-device-config.md. Try to remove the WebDriverAgentRunner application from the device if it is installed and reboot the device.
at getResponseForW3CError (/usr/local/lib/node_modules/appium/node_modules/appium-base-driver/lib/protocol/errors.js:804:9)
at asyncHandler (/usr/local/lib/node_modules/appium/node_modules/appium-base-driver/lib/protocol/protocol.js:380:37)
at runNextTicks (node:internal/process/task_queues:61:5)
at processImmediate (node:internal/timers:437:9)
at org.openqa.selenium.remote.W3CHandshakeResponse.lambda$errorHandler$0(W3CHandshakeResponse.java:62)
at org.openqa.selenium.remote.HandshakeResponse.lambda$getResponseFunction$0(HandshakeResponse.java:30)
at org.openqa.selenium.remote.ProtocolHandshake.lambda$createSession$0(ProtocolHandshake.java:126)
at org.openqa.selenium.remote.ProtocolHandshake.createSession(ProtocolHandshake.java:128)
… 21 more