Error Jenkins IOS Mobile Xcuitest

About a issue in Katalon Studio on Jenkins, error in the execution for example Katalon, add issue and log on Jenkins MAC IOS

[BaseDriver] The following capabilities were provided, but are not recognized by appium: realDeviceLogger.
[BaseDriver] Session created with session id: af3cdd46-be6b-4ea2-b7f6-ddf667557a41
[XCUITest] Error: Command ‘idevice_id -l’ exited with code null
at ChildProcess. (…/…/lib/teen_process.js:70:19)
at emitTwo (events.js:125:13)
at ChildProcess.emit (events.js:213:7)
at maybeClose (internal/child_process.js:927:16)
at Socket.stream.socket.on (internal/child_process.js:348:11)
at emitOne (events.js:115:13)
at Socket.emit (events.js:210:7)
at Pipe._handle.close [as _onclose] (net.js:549:12)
{ Error: Command ‘idevice_id -l’ exited with code null
at ChildProcess. (…/…/lib/teen_process.js:70:19)
at emitTwo (events.js:125:13)
at ChildProcess.emit (events.js:213:7)
at maybeClose (internal/child_process.js:927:16)
at Socket.stream.socket.on (internal/child_process.js:348:11)
at emitOne (events.js:115:13)
at Socket.emit (events.js:210:7)
at Pipe._handle.close [as _onclose] (net.js:549:12)
stdout: ‘’,
stderr: ‘dyld: Library not loaded: @executable_path/…/lib/libssl.1.0.0.dylib\n Referenced from: /Applications/Katalon Studio.app/Contents/Eclipse/configuration/resources/tools/imobiledevice/idevice_id\n Reason: image not found\n’,
code: null }
[MJSONWP] Encountered internal error running command: Error: Command ‘idevice_id -l’ exited with code null
at ChildProcess. (…/…/lib/teen_process.js:70:19)
at emitTwo (events.js:125:13)
at ChildProcess.emit (events.js:213:7)
at maybeClose (internal/child_process.js:927:16)
at Socket.stream.socket.on (internal/child_process.js:348:11)
at emitOne (events.js:115:13)
at Socket.emit (events.js:210:7)
at Pipe._handle.close [as _onclose] (net.js:549:12)
[HTTP] ← POST /wd/hub/session 500 565 ms - 182
08-11-2017 11:03:40 AM - [FAILED] - Unable to start app at: ‘/Movil/IPA/P_10.ipa’ (Root cause: org.openqa.selenium.WebDriverException: An unknown server-side error occurred while processing the command. Original error: Command ‘idevice_id -l’ exited with code null (WARNING: The server did not provide any stacktrace information)
Command duration or timeout: 731 milliseconds
Build info: version: ‘2.53.0’, revision: ‘35ae25b’, time: ‘2016-03-15 17:00:58’
System info: host: ‘MacBook-Pro’, ip: ‘192.168.0.17’, os.name: ‘Mac OS X’, os.arch: ‘x86_64’, os.version: ‘10.12.5’, java.version: ‘1.8.0_131’
Driver info: io.appium.java_client.ios.IOSDriver)
08-11-2017 11:03:40 AM - [END] - End action : startApplication
08-11-2017 11:03:40 AM - [FAILED] - Test Cases/1 Login/1 Flujo Login FAILED because (of) Unable to start app at: ‘/Movil/IPA/lP_10.ipa’ (Root cause: org.openqa.selenium.WebDriverException: An unknown server-side error occurred while processing the command. Original error: Command ‘idevice_id -l’ exited with code null (WARNING: The server did not provide any stacktrace information)
Command duration or timeout: 731 milliseconds
Build info: version: ‘2.53.0’, revision: ‘35ae25b’, time: ‘2016-03-15 17:00:58’
System info: host: ‘MacBook-Pro’, ip: ‘192.168.0.17’, os.name: ‘Mac OS X’, os.arch: ‘x86_64’, os.version: ‘10.12.5’, java.version: ‘1.8.0_131’
Driver info: io.appium.java_client.ios.IOSDriver)
08-11-2017 11:03:40 AM - [END] - End Test Case : Test Cases/1 Login/1 Flujo Login
08-11-2017 11:03:40 AM - [FAILED] - Unable to call Test Case with id ‘Test Cases/1 Login/1 Flujo Login’ (Root cause: Call Test Case ‘Test Cases/1 Login/1 Flujo Login’ failed)
08-11-2017 11:03:40 AM - [FAILED] - Test Cases/BMovil Flujos/T_086 FAILED because (of) Unable to start app at: ‘/Movil/IPA/P_10.ipa’ (Root cause: org.openqa.selenium.WebDriverException: An unknown server-side error occurred while processing the command. Original error: Command ‘idevice_id -l’ exited with code null (WARNING: The server did not provide any stacktrace information)
Command duration or timeout: 731 milliseconds
Build info: version: ‘2.53.0’, revision: ‘35ae25b’, time: ‘2016-03-15 17:00:58’
System info: host: ‘MacBook-Pro’, ip: ‘192.168.0.17’, os.name: ‘Mac OS X’, os.arch: ‘x86_64’, os.version: ‘10.12.5’, java.version: ‘1.8.0_131’
Driver info: io.appium.java_client.ios.IOSDriver)

About a issue in Katalon Studio on Jenkins, error in the execution for example Katalon, add issue and log on Jenkins MAC IOS

[BaseDriver] The following capabilities were provided, but are not recognized by appium: realDeviceLogger.
[BaseDriver] Session created with session id: af3cdd46-be6b-4ea2-b7f6-ddf667557a41
[XCUITest] Error: Command ‘idevice_id -l’ exited with code null
at ChildProcess. (…/…/lib/teen_process.js:70:19)
at emitTwo (events.js:125:13)
at ChildProcess.emit (events.js:213:7)
at maybeClose (internal/child_process.js:927:16)
at Socket.stream.socket.on (internal/child_process.js:348:11)
at emitOne (events.js:115:13)
at Socket.emit (events.js:210:7)
at Pipe._handle.close [as _onclose] (net.js:549:12)
{ Error: Command ‘idevice_id -l’ exited with code null
at ChildProcess. (…/…/lib/teen_process.js:70:19)
at emitTwo (events.js:125:13)
at ChildProcess.emit (events.js:213:7)
at maybeClose (internal/child_process.js:927:16)
at Socket.stream.socket.on (internal/child_process.js:348:11)
at emitOne (events.js:115:13)
at Socket.emit (events.js:210:7)
at Pipe._handle.close [as _onclose] (net.js:549:12)
stdout: ‘’,
stderr: ‘dyld: Library not loaded: @executable_path/…/lib/libssl.1.0.0.dylib\n Referenced from: /Applications/Katalon Studio.app/Contents/Eclipse/configuration/resources/tools/imobiledevice/idevice_id\n Reason: image not found\n’,
code: null }
[MJSONWP] Encountered internal error running command: Error: Command ‘idevice_id -l’ exited with code null
at ChildProcess. (…/…/lib/teen_process.js:70:19)
at emitTwo (events.js:125:13)
at ChildProcess.emit (events.js:213:7)
at maybeClose (internal/child_process.js:927:16)
at Socket.stream.socket.on (internal/child_process.js:348:11)
at emitOne (events.js:115:13)
at Socket.emit (events.js:210:7)
at Pipe._handle.close [as _onclose] (net.js:549:12)
[HTTP] <-- POST /wd/hub/session 500 565 ms - 182
08-11-2017 11:03:40 AM - [FAILED] - Unable to start app at: ‘/Movil/IPA/P_10.ipa’ (Root cause: org.openqa.selenium.WebDriverException: An unknown server-side error occurred while processing the command. Original error: Command ‘idevice_id -l’ exited with code null (WARNING: The server did not provide any stacktrace information)
Command duration or timeout: 731 milliseconds
Build info: version: ‘2.53.0’, revision: ‘35ae25b’, time: ‘2016-03-15 17:00:58’
System info: host: ‘MacBook-Pro’, ip: ‘192.168.0.17’, os.name: ‘Mac OS X’, os.arch: ‘x86_64’, os.version: ‘10.12.5’, java.version: ‘1.8.0_131’
Driver info: io.appium.java_client.ios.IOSDriver)
08-11-2017 11:03:40 AM - [END] - End action : startApplication
08-11-2017 11:03:40 AM - [FAILED] - Test Cases/1 Login/1 Flujo Login FAILED because (of) Unable to start app at: ‘/Movil/IPA/lP_10.ipa’ (Root cause: org.openqa.selenium.WebDriverException: An unknown server-side error occurred while processing the command. Original error: Command ‘idevice_id -l’ exited with code null (WARNING: The server did not provide any stacktrace information)
Command duration or timeout: 731 milliseconds
Build info: version: ‘2.53.0’, revision: ‘35ae25b’, time: ‘2016-03-15 17:00:58’
System info: host: ‘MacBook-Pro’, ip: ‘192.168.0.17’, os.name: ‘Mac OS X’, os.arch: ‘x86_64’, os.version: ‘10.12.5’, java.version: ‘1.8.0_131’
Driver info: io.appium.java_client.ios.IOSDriver)
08-11-2017 11:03:40 AM - [END] - End Test Case : Test Cases/1 Login/1 Flujo Login
08-11-2017 11:03:40 AM - [FAILED] - Unable to call Test Case with id ‘Test Cases/1 Login/1 Flujo Login’ (Root cause: Call Test Case ‘Test Cases/1 Login/1 Flujo Login’ failed)
08-11-2017 11:03:40 AM - [FAILED] - Test Cases/BMovil Flujos/T_086 FAILED because (of) Unable to start app at: ‘/Movil/IPA/P_10.ipa’ (Root cause: org.openqa.selenium.WebDriverException: An unknown server-side error occurred while processing the command. Original error: Command ‘idevice_id -l’ exited with code null (WARNING: The server did not provide any stacktrace information)
Command duration or timeout: 731 milliseconds
Build info: version: ‘2.53.0’, revision: ‘35ae25b’, time: ‘2016-03-15 17:00:58’
System info: host: ‘MacBook-Pro’, ip: ‘192.168.0.17’, os.name: ‘Mac OS X’, os.arch: ‘x86_64’, os.version: ‘10.12.5’, java.version: ‘1.8.0_131’
Driver info: io.appium.java_client.ios.IOSDriver)

Hi there,

Have you followed configuration guide for iOS device completely? https://docs.katalon.com/display/KD/Mobile+on+macOS. That errors not related to Katalon Studio, it related to your configuration on Mac OS

Thanks

____________________
Thank you for choosing Katalon Studio as your automation solution.
Your feedback is needed to make Katalon Studio a better tool, take the survey at: https://goo.gl/S25NVO

The topic is closed due to inactiveness. Feel free to open a new one if you have any concerns.