Error al dar clic en el boton Guardar

Hola, estoy realizando una prueba y al guardar, me genera el siguiente error, no he podido dar con la solucion, me pueden colaborar con la solucion, por favor.

Codigo:
import static com.kms.katalon.core.checkpoint.CheckpointFactory.findCheckpoint
import static com.kms.katalon.core.testcase.TestCaseFactory.findTestCase
import static com.kms.katalon.core.testdata.TestDataFactory.findTestData
import static com.kms.katalon.core.testobject.ObjectRepository.findTestObject
import com.kms.katalon.core.checkpoint.Checkpoint as Checkpoint
import com.kms.katalon.core.checkpoint.CheckpointFactory as CheckpointFactory
import com.kms.katalon.core.mobile.keyword.MobileBuiltInKeywords as MobileBuiltInKeywords
import com.kms.katalon.core.mobile.keyword.MobileBuiltInKeywords as Mobile
import com.kms.katalon.core.model.FailureHandling as FailureHandling
import com.kms.katalon.core.testcase.TestCase as TestCase
import com.kms.katalon.core.testcase.TestCaseFactory as TestCaseFactory
import com.kms.katalon.core.testdata.TestData as TestData
import com.kms.katalon.core.testdata.TestDataFactory as TestDataFactory
import com.kms.katalon.core.testobject.ObjectRepository as ObjectRepository
import com.kms.katalon.core.testobject.TestObject as TestObject
import com.kms.katalon.core.webservice.keyword.WSBuiltInKeywords as WSBuiltInKeywords
import com.kms.katalon.core.webservice.keyword.WSBuiltInKeywords as WS
import com.kms.katalon.core.webui.keyword.WebUiBuiltInKeywords as WebUiBuiltInKeywords
import com.kms.katalon.core.webui.keyword.WebUiBuiltInKeywords as WebUI
import internal.GlobalVariable as GlobalVariable
import org.openqa.selenium.Keys as Keys

WebUI.openBrowser(’’)

WebUI.navigateToUrl(‘http://34.214.247.247:8106/app_oracle.php/meeting/newTeam’)

WebUI.setText(findTestObject(‘Acta1/Page_Daruma Software Quality Manag/input_signinusername’), ‘pcaicedo’)

WebUI.setText(findTestObject(‘Acta1/Page_Daruma Software Quality Manag/input_signinpassword’), ‘daruma’)

WebUI.click(findTestObject(‘Acta1/Page_Daruma Software Quality Manag/input_btn btn-primary btn-bloc’))

WebUI.selectOptionByValue(findTestObject(‘Acta1/Page_Daruma Software Quality Manag/select_Comit integral’), ‘2’, true)

WebUI.setText(findTestObject(‘Acta1/Page_Daruma Software Quality Manag/input_meeting_teamname’), ‘comite’)

WebUI.setText(findTestObject(‘Acta1/Page_Daruma Software Quality Manag/input_source_meeting_teamtheme’), ‘ddd’)

WebUI.click(findTestObject(‘Acta1/Page_Daruma Software Quality Manag/span_’))

WebUI.click(findTestObject(‘Acta1/Page_Daruma Software Quality Manag/input_btn btn-primary btn-bloc’))

WebUI.click(findTestObject(‘Acta1/Page_/a_Regresar’))

WebUI.closeBrowser()

ERROR:
05-02-2018 04:22:42 PM - [FAILED] - Unable to click on object ‘Object Repository/Acta1/Page_Daruma Software Quality Manag/input_btn btn-primary btn-bloc’ (Root cause: org.openqa.selenium.WebDriverException: unknown error: Element is not clickable at point (672, 33). Other element would receive the click:

Nuevo Comité


(Session info: chrome=66.0.3359.139)
(Driver info: chromedriver=2.35.528161 (5b82f2d2aae0ca24b877009200ced9065a772e73),platform=Windows NT 6.3.9600 x86_64) (WARNING: The server did not provide any stacktrace information)
Command duration or timeout: 0 milliseconds
Build info: version: ‘3.7.1’, revision: ‘8a0099a’, time: ‘2017-11-06T21:07:36.161Z’
System info: host: ‘CDST-IDADCPC’, ip: ‘10.186.163.119’, os.name: ‘Windows 8.1’, os.arch: ‘amd64’, os.version: ‘6.3’, java.version: ‘1.8.0_102’
Driver info: com.kms.katalon.selenium.driver.CChromeDriver
Capabilities {acceptInsecureCerts: false, acceptSslCerts: false, applicationCacheEnabled: false, browserConnectionEnabled: false, browserName: chrome, chrome: {chromedriverVersion: 2.35.528161 (5b82f2d2aae0ca…, userDataDir: C:\Users\PCAICE~1.002\AppDa…}, cssSelectorsEnabled: true, databaseEnabled: false, handlesAlerts: true, hasTouchScreen: false, javascriptEnabled: true, locationContextEnabled: true, mobileEmulationEnabled: false, nativeEvents: true, networkConnectionEnabled: false, pageLoadStrategy: normal, platform: XP, platformName: XP, rotatable: false, setWindowRect: true, takesHeapSnapshot: true, takesScreenshot: true, unexpectedAlertBehaviour: , unhandledPromptBehavior: , version: 66.0.3359.139, webStorageEnabled: true}
Session ID: 1f45341e5b38f79f068731990961c72d)
05-02-2018 04:22:42 PM - [END] - End action : click
05-02-2018 04:22:42 PM - [FAILED] - Test Cases/ACTA1 FAILED because (of) Unable to click on object ‘Object Repository/Acta1/Page_Daruma Software Quality Manag/input_btn btn-primary btn-bloc’ (Root cause: org.openqa.selenium.WebDriverException: unknown error: Element is not clickable at point (672, 33). Other element would receive the click:

Nuevo Comité


(Session info: chrome=66.0.3359.139)
(Driver info: chromedriver=2.35.528161 (5b82f2d2aae0ca24b877009200ced9065a772e73),platform=Windows NT 6.3.9600 x86_64) (WARNING: The server did not provide any stacktrace information)
Command duration or timeout: 0 milliseconds
Build info: version: ‘3.7.1’, revision: ‘8a0099a’, time: ‘2017-11-06T21:07:36.161Z’
System info: host: ‘CDST-IDADCPC’, ip: ‘10.186.163.119’, os.name: ‘Windows 8.1’, os.arch: ‘amd64’, os.version: ‘6.3’, java.version: ‘1.8.0_102’
Driver info: com.kms.katalon.selenium.driver.CChromeDriver
Capabilities {acceptInsecureCerts: false, acceptSslCerts: false, applicationCacheEnabled: false, browserConnectionEnabled: false, browserName: chrome, chrome: {chromedriverVersion: 2.35.528161 (5b82f2d2aae0ca…, userDataDir: C:\Users\PCAICE~1.002\AppDa…}, cssSelectorsEnabled: true, databaseEnabled: false, handlesAlerts: true, hasTouchScreen: false, javascriptEnabled: true, locationContextEnabled: true, mobileEmulationEnabled: false, nativeEvents: true, networkConnectionEnabled: false, pageLoadStrategy: normal, platform: XP, platformName: XP, rotatable: false, setWindowRect: true, takesHeapSnapshot: true, takesScreenshot: true, unexpectedAlertBehaviour: , unhandledPromptBehavior: , version: 66.0.3359.139, webStorageEnabled: true}
Session ID: 1f45341e5b38f79f068731990961c72d)

Can you please re-write your question in English please ?