|
Execution on jenkins with license trial in valid period not is executed
|
|
2
|
1010
|
August 10, 2022
|
|
Runtime generates corrupted "testCaseBinding." file when -reportFolder=<path> option is used
|
|
0
|
877
|
July 25, 2022
|
|
Runtime Agent Error 403 occurs after 1hour of test
|
|
6
|
2592
|
July 22, 2022
|
|
java.lang.NoClassDefFoundError: javax/xml/bind/JAXBException error while running test suites
|
|
11
|
6470
|
July 22, 2022
|
|
Unable to change JRE in Katalon Runtime Engine
|
|
7
|
2660
|
July 10, 2022
|
|
KRE error running tests in Azure DevOps CI/CD release pipeline
|
|
3
|
1507
|
June 20, 2022
|
|
javax.net.ssl.SSLHandshakeException: No appropriate protocol
|
|
3
|
3850
|
June 17, 2022
|
|
Can't find katalonc.exe in my katalon folder?
|
|
1
|
1452
|
June 15, 2022
|
|
Best method to parameterize a large amount of configurations for execution on CI/CD?
|
|
3
|
1160
|
June 1, 2022
|
|
Runtime Engine - Licences
|
|
1
|
798
|
May 30, 2022
|
|
Katalon Engine not correctly load Custom Keyword plugin
|
|
12
|
2240
|
May 20, 2022
|
|
Setting Variable Bindings when using Katalon Runtime Engine
|
|
0
|
941
|
April 29, 2022
|
|
DOCKER - Tips for Reducing Runtime?
|
|
2
|
1389
|
April 20, 2022
|
|
Browser fails to open when test suite is executed with Runtime Engine
|
|
2
|
2232
|
April 14, 2022
|
|
Email verification for account not received
|
|
2
|
472
|
April 14, 2022
|
|
WebDriverException: unknown error: cannot find Chrome binary in Jenkins
|
|
3
|
4137
|
April 6, 2022
|
|
KRE offline activation question about the num of RE running sessions
|
|
5
|
1875
|
March 29, 2022
|
|
Unable To Download KRE
|
|
3
|
966
|
March 16, 2022
|
|
Unable to execute test suite
|
|
3
|
1640
|
March 8, 2022
|
|
Docker run Katalon runtime engine fails with "Test suite not found"
|
|
1
|
1628
|
March 4, 2022
|
|
Code to run parallel execution on runtime engine
|
|
0
|
700
|
February 25, 2022
|
|
Trial License to work with docker is not working
|
|
0
|
870
|
February 25, 2022
|
|
Runtime Agent not visible in Katalon test Ops
|
|
0
|
747
|
February 25, 2022
|
|
I'm trying to run the test suite via cmd but no luck
|
|
1
|
835
|
February 23, 2022
|
|
Katalon Runtime Engine doesn't close a browser
|
|
7
|
2336
|
February 12, 2022
|
|
Can I use KRE (paid) and Katalon Studio (free)?
|
|
3
|
1296
|
February 7, 2022
|
|
During Unzipping/extracting of runtime engine folder
|
|
2
|
1145
|
February 2, 2022
|
|
Issue in continuous integration with GitLab when try to run pipeline using GitLab runner
|
|
0
|
1125
|
February 1, 2022
|
|
Runtime Engine - floating license question
|
|
0
|
802
|
January 26, 2022
|
|
KRE crashes saying "java.io.IOException: There is not enough space on the disk", but the disk is not full
|
|
3
|
1865
|
January 26, 2022
|