# \[WebUI\] Not able to click Hyperlink option on Jquery UI Page

**URL:** <https://forum.katalon.com/t/webui-not-able-to-click-hyperlink-option-on-jquery-ui-page/11679>\
**Category:** Miscellaneous\
**Created:** [June 22, 2018, 12:33pm UTC](https://forum.katalon.com/t/webui-not-able-to-click-hyperlink-option-on-jquery-ui-page/11679 "2018-06-22T12:33:43Z")\
**Posts on this page:** 1\
**Page:** 1

<div class="post-metadata">

**Author:** ![test\_name](https://avatars.discourse-cdn.com/v4/letter/t/eb8c5e/32.png) [@test\_name](https://forum.katalon.com/u/test_name)\
**Post date:** [June 22, 2018, 12:33pm UTC](https://forum.katalon.com/t/webui-not-able-to-click-hyperlink-option-on-jquery-ui-page/11679/1 "2018-06-22T12:33:43Z")

</div>

Hello,

I am facing one issue while clicking on hyperlink from the webpage using katalon studio. I have created test script using “Selenium C# in Visual studio” and able to run easily. So i don’t know what is the issue in Katalon script

Steps:  
1. open Url : [https://jqueryui.com/](https://jqueryui.com/)  
2. Maximize the window  
3. Click on “Draggable” link option under “Interactions”

I am facing below issue

Issue :

Test Cases/Functional Test/IframeTest FAILED because (of) org.codehaus.groovy.runtime.InvokerInvocationException: com.kms.katalon.core.webui.exception.WebElementNotFoundException: Web element with id: ‘Object Repository/Iframe/Page\_Droppable jQuery UI/a\_Draggable’ located by 'By.xpath: //a[[@href](http://forum.katalon.com/profile//href) = ‘[http://jqueryui.com/draggable/’](http://jqueryui.com/draggable/') and (text() = ‘Draggable’ or . = ‘Draggable’)]’ not found

utility.UtilityClass.invokeMethod:0

Test Cases/Functional Test/IframeTest.run:36

Please do the needful and guide me on that
