# Unable to create this

**URL:** <https://forum.katalon.com/t/unable-to-create-this/62487>\
**Category:** Mobile Testing\
**Tags:** mobile-testing, katalon-studio\
**Created:** [February 14, 2022, 10:48am UTC](https://forum.katalon.com/t/unable-to-create-this/62487 "2022-02-14T10:48:40Z")\
**Posts on this page:** 1\
**Page:** 1

<div class="post-metadata">

**Author:** ![GIO](https://dub1.discourse-cdn.com/katalon/user_avatar/forum.katalon.com/gio/32/16104_2.png) [@GIO](https://forum.katalon.com/u/GIO)\
**Post date:** [February 14, 2022, 10:48am UTC](https://forum.katalon.com/t/unable-to-create-this/62487/1 "2022-02-14T10:48:40Z")

</div>

**Hello I’m Getting the following error and i cant run my mobile test to record ro caputure**

=============== ROOT CAUSE =====================  
Caused by: java.lang.reflect.InvocationTargetException

# For trouble shooting, please visit: [https://docs.katalon.com/katalon-studio/docs/troubleshooting.html](https://docs.katalon.com/katalon-studio/docs/troubleshooting.html)

02-14-2022 11:37:05 AM Test Cases/MBTC1

Elapsed time: 5.556s

Test Cases/MBTC1 FAILED.  
Reason:  
com.kms.katalon.core.exception.StepFailedException: Unable to start app at: ‘C:\Users\TT\Katalon Studio\MobileTestProjectSample\androidapp\APIDemos.apk’ (Root cause: org.openqa.selenium.SessionNotCreatedException: Unable to create a new remote session. Please check the server log for more details. Original error: An unknown server-side error occurred while processing the command. Original error: The application at ‘C:\Users\TT\Katalon Studio\MobileTestProjectSample\androidapp\APIDemos.apk’ does not exist or is not accessible  
Build info: version: ‘3.141.59’, revision: ‘e82be7d358’, time: ‘2018-11-14T08:25:53’  
System info: host: ‘DESKTOP-H2PS5GU’, ip: ‘192.168.1.118’, os.name: ‘Windows 10’, os.arch: ‘amd64’, os.version: ‘10.0’, java.version: ‘1.8.0\_282’  
Driver info: driver.version: SwipeableAndroidDriver  
remote stacktrace: UnknownError: An unknown server-side error occurred while processing the command. Original error: The application at ‘C:\Users\TT\Katalon Studio\MobileTestProjectSample\androidapp\APIDemos.apk’ does not exist or is not accessible  
at getResponseForW3CError (C:\Users\TT\AppData\Roaming\npm\node\_modules\appium\node\_modules\appium-base-driver\lib\protocol\errors.js:804:9)  
at asyncHandler (C:\Users\TT\AppData\Roaming\npm\node\_modules\appium\node\_modules\appium-base-driver\lib\protocol\protocol.js:380:37)  
Build info: version: ‘3.141.59’, revision: ‘e82be7d358’, time: ‘2018-11-14T08:25:53’  
System info: host: ‘DESKTOP-H2PS5GU’, ip: ‘192.168.1.118’, os.name: ‘Windows 10’, os.arch: ‘amd64’, os.version: ‘10.0’, java.version: ‘1.8.0\_282’  
Driver info: driver.version: SwipeableAndroidDriver  
at io.appium.java\_client.remote.AppiumCommandExecutor$1.createSession(AppiumCommandExecutor.java:208)  
at io.appium.java\_client.remote.AppiumCommandExecutor.createSession(AppiumCommandExecutor.java:217)  
at io.appium.java\_client.remote.AppiumCommandExecutor.execute(AppiumCommandExecutor.java:239)  
at org.openqa.selenium.remote.RemoteWebDriver.execute(RemoteWebDriver.java:552)  
at io.appium.java\_client.DefaultGenericMobileDriver.execute(DefaultGenericMobileDriver.java:42)  
at io.appium.java\_client.AppiumDriver.execute(AppiumDriver.java:1)  
at io.appium.java\_client.android.AndroidDriver.execute(AndroidDriver.java:1)  
at com.kms.katalon.core.appium.driver.SwipeableAndroidDriver.execute(SwipeableAndroidDriver.java:1)  
at org.openqa.selenium.remote.RemoteWebDriver.startSession(RemoteWebDriver.java:213)  
at org.openqa.selenium.remote.RemoteWebDriver.(RemoteWebDriver.java:131)  
at io.appium.java\_client.DefaultGenericMobileDriver.(DefaultGenericMobileDriver.java:38)  
at io.appium.java\_client.AppiumDriver.(AppiumDriver.java:84)  
at io.appium.java\_client.android.AndroidDriver.(AndroidDriver.java:85)  
at com.kms.katalon.core.appium.driver.SwipeableAndroidDriver.(SwipeableAndroidDriver.java:24)  
at com.kms.katalon.core.appium.driver.AppiumDriverManager.createMobileDriver(AppiumDriverManager.java:498)  
at com.kms.katalon.core.appium.driver.AppiumDriverManager.createMobileDriver(AppiumDriverManager.java:480)  
at com.kms.katalon.core.mobile.keyword.internal.MobileDriverFactory.startLocalMobileDriver(MobileDriverFactory.java:539)  
at com.kms.katalon.core.mobile.keyword.internal.MobileDriverFactory.startMobileDriver(MobileDriverFactory.java:452)  
at com.kms.katalon.core.mobile.keyword.builtin.StartApplicationKeyword$\_startApplication\_closure1.doCall(StartApplicationKeyword.groovy:49)  
at com.kms.katalon.core.mobile.keyword.builtin.StartApplicationKeyword$\_startApplication\_closure1.call(StartApplicationKeyword.groovy)  
at com.kms.katalon.core.mobile.keyword.internal.MobileKeywordMain.runKeyword(MobileKeywordMain.groovy:21)  
at com.kms.katalon.core.mobile.keyword.builtin.StartApplicationKeyword.startApplication(StartApplicationKeyword.groovy:51)  
at com.kms.katalon.core.mobile.keyword.builtin.StartApplicationKeyword.execute(StartApplicationKeyword.groovy:40)  
at com.kms.katalon.core.keyword.internal.KeywordExecutor.executeKeywordForPlatform(KeywordExecutor.groovy:74)  
at com.kms.katalon.core.mobile.keyword.MobileBuiltInKeywords.startApplication(MobileBuiltInKeywords.groovy:78)  
at com.kms.katalon.core.mobile.keyword.MobileBuiltInKeywords$startApplication.call(Unknown Source)  
at MBTC1.run(MBTC1:20)  
at com.kms.katalon.core.main.ScriptEngine.run(ScriptEngine.java:194)  
at com.kms.katalon.core.main.ScriptEngine.runScriptAsRawText(ScriptEngine.java:119)  
at com.kms.katalon.core.main.TestCaseExecutor.runScript(TestCaseExecutor.java:442)  
at com.kms.katalon.core.main.TestCaseExecutor.doExecute(TestCaseExecutor.java:433)  
at com.kms.katalon.core.main.TestCaseExecutor.processExecutionPhase(TestCaseExecutor.java:412)  
at com.kms.katalon.core.main.TestCaseExecutor.accessMainPhase(TestCaseExecutor.java:404)  
at com.kms.katalon.core.main.TestCaseExecutor.execute(TestCaseExecutor.java:281)  
at com.kms.katalon.core.main.TestCaseMain.runTestCase(TestCaseMain.java:142)  
at com.kms.katalon.core.main.TestCaseMain.runTestCase(TestCaseMain.java:133)  
at com.kms.katalon.core.main.TestCaseMain$runTestCase$0.call(Unknown Source)  
at TempTestCase1644831420579.run(TempTestCase1644831420579.groovy:25)  
Caused by: java.lang.reflect.InvocationTargetException  
at io.appium.java\_client.remote.AppiumCommandExecutor$1.createSession(AppiumCommandExecutor.java:186)  
at io.appium.java\_client.remote.AppiumCommandExecutor.createSession(AppiumCommandExecutor.java:217)  
at io.appium.java\_client.remote.AppiumCommandExecutor.execute(AppiumCommandExecutor.java:239)  
at org.openqa.selenium.remote.RemoteWebDriver.execute(RemoteWebDriver.java:552)  
at io.appium.java\_client.DefaultGenericMobileDriver.execute(DefaultGenericMobileDriver.java:42)  
at io.appium.java\_client.AppiumDriver.execute(AppiumDriver.java:1)  
at io.appium.java\_client.android.AndroidDriver.execute(AndroidDriver.java:1)  
at com.kms.katalon.core.appium.driver.SwipeableAndroidDriver.execute(SwipeableAndroidDriver.java:1)  
at org.openqa.selenium.remote.RemoteWebDriver.startSession(RemoteWebDriver.java:213)  
at org.openqa.selenium.remote.RemoteWebDriver.(RemoteWebDriver.java:131)  
at io.appium.java\_client.DefaultGenericMobileDriver.(DefaultGenericMobileDriver.java:38)  
at io.appium.java\_client.AppiumDriver.(AppiumDriver.java:84)  
at io.appium.java\_client.android.AndroidDriver.(AndroidDriver.java:85)  
at com.kms.katalon.core.appium.driver.SwipeableAndroidDriver.(SwipeableAndroidDriver.java:24)  
at com.kms.katalon.core.appium.driver.AppiumDriverManager.createMobileDriver(AppiumDriverManager.java:498)  
at com.kms.katalon.core.appium.driver.AppiumDriverManager.createMobileDriver(AppiumDriverManager.java:480)  
at com.kms.katalon.core.mobile.keyword.internal.MobileDriverFactory.startLocalMobileDriver(MobileDriverFactory.java:539)  
at com.kms.katalon.core.mobile.keyword.internal.MobileDriverFactory.startMobileDriver(MobileDriverFactory.java:452)  
at com.kms.katalon.core.mobile.keyword.builtin.StartApplicationKeyword$\_startApplication\_closure1.doCall(StartApplicationKeyword.groovy:49)  
at com.kms.katalon.core.mobile.keyword.builtin.StartApplicationKeyword$\_startApplication\_closure1.call(StartApplicationKeyword.groovy)  
at com.kms.katalon.core.mobile.keyword.internal.MobileKeywordMain.runKeyword(MobileKeywordMain.groovy:21)  
at com.kms.katalon.core.mobile.keyword.builtin.StartApplicationKeyword.startApplication(StartApplicationKeyword.groovy:51)  
at com.kms.katalon.core.mobile.keyword.builtin.StartApplicationKeyword.execute(StartApplicationKeyword.groovy:40)  
at com.kms.katalon.core.keyword.internal.KeywordExecutor.executeKeywordForPlatform(KeywordExecutor.groovy:74)  
at com.kms.katalon.core.mobile.keyword.MobileBuiltInKeywords.startApplication(MobileBuiltInKeywords.groovy:78)  
at com.kms.katalon.core.mobile.keyword.MobileBuiltInKeywords$startApplication.call(Unknown Source)  
at Script1644588999645.run(Script1644588999645.groovy:20)  
… 11 more  
Caused by: org.openqa.selenium.WebDriverException: An unknown server-side error occurred while processing the command. Original error: The application at ‘C:\Users\TT\Katalon Studio\MobileTestProjectSample\androidapp\APIDemos.apk’ does not exist or is not accessible  
Build info: version: ‘3.141.59’, revision: ‘e82be7d358’, time: ‘2018-11-14T08:25:53’  
System info: host: ‘DESKTOP-H2PS5GU’, ip: ‘192.168.1.118’, os.name: ‘Windows 10’, os.arch: ‘amd64’, os.version: ‘10.0’, java.version: ‘1.8.0\_282’  
Driver info: driver.version: SwipeableAndroidDriver  
remote stacktrace: UnknownError: An unknown server-side error occurred while processing the command. Original error: The application at ‘C:\Users\TT\Katalon Studio\MobileTestProjectSample\androidapp\APIDemos.apk’ does not exist or is not accessible  
at getResponseForW3CError (C:\Users\TT\AppData\Roaming\npm\node\_modules\appium\node\_modules\appium-base-driver\lib\protocol\errors.js:804:9)  
at asyncHandler (C:\Users\TT\AppData\Roaming\npm\node\_modules\appium\node\_modules\appium-base-driver\lib\protocol\protocol.js:380:37)  
at org.openqa.selenium.remote.W3CHandshakeResponse.lambda$errorHandler$0(W3CHandshakeResponse.java:62)  
at org.openqa.selenium.remote.HandshakeResponse.lambda$getResponseFunction$0(HandshakeResponse.java:30)  
at org.openqa.selenium.remote.ProtocolHandshake.lambda$createSession$0(ProtocolHandshake.java:126)  
at org.openqa.selenium.remote.ProtocolHandshake.createSession(ProtocolHandshake.java:128)  
… 38 more  
)  
at com.kms.katalon.core.keyword.internal.KeywordMain.stepFailed(KeywordMain.groovy:50)  
at com.kms.katalon.core.mobile.keyword.internal.MobileKeywordMain.stepFailed(MobileKeywordMain.groovy:40)  
at com.kms.katalon.core.mobile.keyword.internal.MobileKeywordMain.runKeyword(MobileKeywordMain.groovy:23)  
at com.kms.katalon.core.mobile.keyword.builtin.StartApplicationKeyword.startApplication(StartApplicationKeyword.groovy:51)  
at com.kms.katalon.core.mobile.keyword.builtin.StartApplicationKeyword.execute(StartApplicationKeyword.groovy:40)  
at com.kms.katalon.core.keyword.internal.KeywordExecutor.executeKeywordForPlatform(KeywordExecutor.groovy:74)  
at com.kms.katalon.core.mobile.keyword.MobileBuiltInKeywords.startApplication(MobileBuiltInKeywords.groovy:78)  
at com.kms.katalon.core.mobile.keyword.MobileBuiltInKeywords$startApplication.call(Unknown Source)  
at MBTC1.run(MBTC1:20)  
at com.kms.katalon.core.main.ScriptEngine.run(ScriptEngine.java:194)  
at com.kms.katalon.core.main.ScriptEngine.runScriptAsRawText(ScriptEngine.java:119)  
at com.kms.katalon.core.main.TestCaseExecutor.runScript(TestCaseExecutor.java:442)  
at com.kms.katalon.core.main.TestCaseExecutor.doExecute(TestCaseExecutor.java:433)  
at com.kms.katalon.core.main.TestCaseExecutor.processExecutionPhase(TestCaseExecutor.java:412)  
at com.kms.katalon.core.main.TestCaseExecutor.accessMainPhase(TestCaseExecutor.java:404)  
at com.kms.katalon.core.main.TestCaseExecutor.execute(TestCaseExecutor.java:281)  
at com.kms.katalon.core.main.TestCaseMain.runTestCase(TestCaseMain.java:142)  
at com.kms.katalon.core.main.TestCaseMain.runTestCase(TestCaseMain.java:133)  
at com.kms.katalon.core.main.TestCaseMain$runTestCase$0.call(Unknown Source)  
at TempTestCase1644831420579.run(TempTestCase1644831420579.groovy:25)  
Caused by: org.openqa.selenium.SessionNotCreatedException: Unable to create a new remote session. Please check the server log for more details. Original error: An unknown server-side error occurred while processing the command. Original error: The application at ‘C:\Users\TT\Katalon Studio\MobileTestProjectSample\androidapp\APIDemos.apk’ does not exist or is not accessible  
Build info: version: ‘3.141.59’, revision: ‘e82be7d358’, time: ‘2018-11-14T08:25:53’  
System info: host: ‘DESKTOP-H2PS5GU’, ip: ‘192.168.1.118’, os.name: ‘Windows 10’, os.arch: ‘amd64’, os.version: ‘10.0’, java.version: ‘1.8.0\_282’  
Driver info: driver.version: SwipeableAndroidDriver  
remote stacktrace: UnknownError: An unknown server-side error occurred while processing the command. Original error: The application at ‘C:\Users\TT\Katalon Studio\MobileTestProjectSample\androidapp\APIDemos.apk’ does not exist or is not accessible  
at getResponseForW3CError (C:\Users\TT\AppData\Roaming\npm\node\_modules\appium\node\_modules\appium-base-driver\lib\protocol\errors.js:804:9)  
at asyncHandler (C:\Users\TT\AppData\Roaming\npm\node\_modules\appium\node\_modules\appium-base-driver\lib\protocol\protocol.js:380:37)  
Build info: version: ‘3.141.59’, revision: ‘e82be7d358’, time: ‘2018-11-14T08:25:53’  
System info: host: ‘DESKTOP-H2PS5GU’, ip: ‘192.168.1.118’, os.name: ‘Windows 10’, os.arch: ‘amd64’, os.version: ‘10.0’, java.version: ‘1.8.0\_282’  
Driver info: driver.version: SwipeableAndroidDriver  
at io.appium.java\_client.remote.AppiumCommandExecutor$1.createSession(AppiumCommandExecutor.java:208)  
at io.appium.java\_client.remote.AppiumCommandExecutor.createSession(AppiumCommandExecutor.java:217)  
at io.appium.java\_client.remote.AppiumCommandExecutor.execute(AppiumCommandExecutor.java:239)  
at org.openqa.selenium.remote.RemoteWebDriver.execute(RemoteWebDriver.java:552)  
at io.appium.java\_client.DefaultGenericMobileDriver.execute(DefaultGenericMobileDriver.java:42)  
at io.appium.java\_client.AppiumDriver.execute(AppiumDriver.java:1)  
at io.appium.java\_client.android.AndroidDriver.execute(AndroidDriver.java:1)  
at com.kms.katalon.core.appium.driver.SwipeableAndroidDriver.execute(SwipeableAndroidDriver.java:1)  
at org.openqa.selenium.remote.RemoteWebDriver.startSession(RemoteWebDriver.java:213)  
at org.openqa.selenium.remote.RemoteWebDriver.(RemoteWebDriver.java:131)  
at io.appium.java\_client.DefaultGenericMobileDriver.(DefaultGenericMobileDriver.java:38)  
at io.appium.java\_client.AppiumDriver.(AppiumDriver.java:84)  
at io.appium.java\_client.android.AndroidDriver.(AndroidDriver.java:85)  
at com.kms.katalon.core.appium.driver.SwipeableAndroidDriver.(SwipeableAndroidDriver.java:24)  
at com.kms.katalon.core.appium.driver.AppiumDriverManager.createMobileDriver(AppiumDriverManager.java:498)  
at com.kms.katalon.core.appium.driver.AppiumDriverManager.createMobileDriver(AppiumDriverManager.java:480)  
at com.kms.katalon.core.mobile.keyword.internal.MobileDriverFactory.startLocalMobileDriver(MobileDriverFactory.java:539)  
at com.kms.katalon.core.mobile.keyword.internal.MobileDriverFactory.startMobileDriver(MobileDriverFactory.java:452)  
at com.kms.katalon.core.mobile.keyword.builtin.StartApplicationKeyword$\_startApplication\_closure1.doCall(StartApplicationKeyword.groovy:49)  
at com.kms.katalon.core.mobile.keyword.builtin.StartApplicationKeyword$\_startApplication\_closure1.call(StartApplicationKeyword.groovy)  
at com.kms.katalon.core.mobile.keyword.internal.MobileKeywordMain.runKeyword(MobileKeywordMain.groovy:21)  
… 17 more  
Caused by: java.lang.reflect.InvocationTargetException  
at io.appium.java\_client.remote.AppiumCommandExecutor$1.createSession(AppiumCommandExecutor.java:186)  
at io.appium.java\_client.remote.AppiumCommandExecutor.createSession(AppiumCommandExecutor.java:217)  
at io.appium.java\_client.remote.AppiumCommandExecutor.execute(AppiumCommandExecutor.java:239)  
at org.openqa.selenium.remote.RemoteWebDriver.execute(RemoteWebDriver.java:552)  
at io.appium.java\_client.DefaultGenericMobileDriver.execute(DefaultGenericMobileDriver.java:42)  
at io.appium.java\_client.AppiumDriver.execute(AppiumDriver.java:1)  
at io.appium.java\_client.android.AndroidDriver.execute(AndroidDriver.java:1)  
at com.kms.katalon.core.appium.driver.SwipeableAndroidDriver.execute(SwipeableAndroidDriver.java:1)  
at org.openqa.selenium.remote.RemoteWebDriver.startSession(RemoteWebDriver.java:213)  
at org.openqa.selenium.remote.RemoteWebDriver.(RemoteWebDriver.java:131)  
at io.appium.java\_client.DefaultGenericMobileDriver.(DefaultGenericMobileDriver.java:38)  
at io.appium.java\_client.AppiumDriver.(AppiumDriver.java:84)  
at io.appium.java\_client.android.AndroidDriver.(AndroidDriver.java:85)  
at com.kms.katalon.core.appium.driver.SwipeableAndroidDriver.(SwipeableAndroidDriver.java:24)  
at com.kms.katalon.core.appium.driver.AppiumDriverManager.createMobileDriver(AppiumDriverManager.java:498)  
at com.kms.katalon.core.appium.driver.AppiumDriverManager.createMobileDriver(AppiumDriverManager.java:480)  
at com.kms.katalon.core.mobile.keyword.internal.MobileDriverFactory.startLocalMobileDriver(MobileDriverFactory.java:539)  
at com.kms.katalon.core.mobile.keyword.internal.MobileDriverFactory.startMobileDriver(MobileDriverFactory.java:452)  
at com.kms.katalon.core.mobile.keyword.builtin.StartApplicationKeyword$\_startApplication\_closure1.doCall(StartApplicationKeyword.groovy:49)  
at com.kms.katalon.core.mobile.keyword.builtin.StartApplicationKeyword$\_startApplication\_closure1.call(StartApplicationKeyword.groovy)  
at com.kms.katalon.core.mobile.keyword.internal.MobileKeywordMain.runKeyword(MobileKeywordMain.groovy:21)  
at com.kms.katalon.core.mobile.keyword.builtin.StartApplicationKeyword.startApplication(StartApplicationKeyword.groovy:51)  
at com.kms.katalon.core.mobile.keyword.builtin.StartApplicationKeyword.execute(StartApplicationKeyword.groovy:40)  
at com.kms.katalon.core.keyword.internal.KeywordExecutor.executeKeywordForPlatform(KeywordExecutor.groovy:74)  
at com.kms.katalon.core.mobile.keyword.MobileBuiltInKeywords.startApplication(MobileBuiltInKeywords.groovy:78)  
at com.kms.katalon.core.mobile.keyword.MobileBuiltInKeywords$startApplication.call(Unknown Source)  
at Script1644588999645.run(Script1644588999645.groovy:20)  
… 11 more  
Caused by: org.openqa.selenium.WebDriverException: An unknown server-side error occurred while processing the command. Original error: The application at ‘C:\Users\TT\Katalon Studio\MobileTestProjectSample\androidapp\APIDemos.apk’ does not exist or is not accessible  
Build info: version: ‘3.141.59’, revision: ‘e82be7d358’, time: ‘2018-11-14T08:25:53’  
System info: host: ‘DESKTOP-H2PS5GU’, ip: ‘192.168.1.118’, os.name: ‘Windows 10’, os.arch: ‘amd64’, os.version: ‘10.0’, java.version: ‘1.8.0\_282’  
Driver info: driver.version: SwipeableAndroidDriver  
remote stacktrace: UnknownError: An unknown server-side error occurred while processing the command. Original error: The application at ‘C:\Users\TT\Katalon Studio\MobileTestProjectSample\androidapp\APIDemos.apk’ does not exist or is not accessible  
at getResponseForW3CError (C:\Users\TT\AppData\Roaming\npm\node\_modules\appium\node\_modules\appium-base-driver\lib\protocol\errors.js:804:9)  
at asyncHandler (C:\Users\TT\AppData\Roaming\npm\node\_modules\appium\node\_modules\appium-base-driver\lib\protocol\protocol.js:380:37)  
at org.openqa.selenium.remote.W3CHandshakeResponse.lambda$errorHandler$0(W3CHandshakeResponse.java:62)  
at org.openqa.selenium.remote.HandshakeResponse.lambda$getResponseFunction$0(HandshakeResponse.java:30)  
at org.openqa.selenium.remote.ProtocolHandshake.lambda$createSession$0(ProtocolHandshake.java:126)  
at org.openqa.selenium.remote.ProtocolHandshake.createSession(ProtocolHandshake.java:128)  
at io.appium.java\_client.remote.AppiumCommandExecutor$1.createSession(AppiumCommandExecutor.java:186)  
at io.appium.java\_client.remote.AppiumCommandExecutor.createSession(AppiumCommandExecutor.java:217)  
at io.appium.java\_client.remote.AppiumCommandExecutor.execute(AppiumCommandExecutor.java:239)  
at org.openqa.selenium.remote.RemoteWebDriver.execute(RemoteWebDriver.java:552)  
at io.appium.java\_client.DefaultGenericMobileDriver.execute(DefaultGenericMobileDriver.java:42)  
at io.appium.java\_client.AppiumDriver.execute(AppiumDriver.java:1)  
at io.appium.java\_client.android.AndroidDriver.execute(AndroidDriver.java:1)  
at com.kms.katalon.core.appium.driver.SwipeableAndroidDriver.execute(SwipeableAndroidDriver.java:1)  
at org.openqa.selenium.remote.RemoteWebDriver.startSession(RemoteWebDriver.java:213)  
at org.openqa.selenium.remote.RemoteWebDriver.(RemoteWebDriver.java:131)  
at io.appium.java\_client.DefaultGenericMobileDriver.(DefaultGenericMobileDriver.java:38)  
at io.appium.java\_client.AppiumDriver.(AppiumDriver.java:84)  
at io.appium.java\_client.android.AndroidDriver.(AndroidDriver.java:85)  
at com.kms.katalon.core.appium.driver.SwipeableAndroidDriver.(SwipeableAndroidDriver.java:24)  
at com.kms.katalon.core.appium.driver.AppiumDriverManager.createMobileDriver(AppiumDriverManager.java:498)  
at com.kms.katalon.core.appium.driver.AppiumDriverManager.createMobileDriver(AppiumDriverManager.java:480)  
at com.kms.katalon.core.mobile.keyword.internal.MobileDriverFactory.startLocalMobileDriver(MobileDriverFactory.java:539)  
at com.kms.katalon.core.mobile.keyword.internal.MobileDriverFactory.startMobileDriver(MobileDriverFactory.java:452)  
at com.kms.katalon.core.mobile.keyword.builtin.StartApplicationKeyword$\_startApplication\_closure1.doCall(StartApplicationKeyword.groovy:49)  
at com.kms.katalon.core.mobile.keyword.builtin.StartApplicationKeyword$\_startApplication\_closure1.call(StartApplicationKeyword.groovy)  
at com.kms.katalon.core.mobile.keyword.internal.MobileKeywordMain.runKeyword(MobileKeywordMain.groovy:21)  
at com.kms.katalon.core.mobile.keyword.builtin.StartApplicationKeyword.startApplication(StartApplicationKeyword.groovy:51)  
at com.kms.katalon.core.mobile.keyword.builtin.StartApplicationKeyword.execute(StartApplicationKeyword.groovy:40)  
at com.kms.katalon.core.keyword.internal.KeywordExecutor.executeKeywordForPlatform(KeywordExecutor.groovy:74)  
at com.kms.katalon.core.mobile.keyword.MobileBuiltInKeywords.startApplication(MobileBuiltInKeywords.groovy:78)  
at com.kms.katalon.core.mobile.keyword.MobileBuiltInKeywords$startApplication.call(Unknown Source)  
at MBTC1.run(MBTC1:20)  
… 11 more
