# My TestCase is failed when I perform run Remote with the Latest Firefox Browser

**URL:** <https://forum.katalon.com/t/my-testcase-is-failed-when-i-perform-run-remote-with-the-latest-firefox-browser/39700>\
**Category:** Web Testing\
**Tags:** katalon-studio\
**Created:** [February 11, 2020, 8:27am UTC](https://forum.katalon.com/t/my-testcase-is-failed-when-i-perform-run-remote-with-the-latest-firefox-browser/39700 "2020-02-11T08:27:05Z")\
**Posts on this page:** 5\
**Page:** 1

<div class="post-metadata">

**Author:** ![trankhoa0702](https://dub1.discourse-cdn.com/katalon/user_avatar/forum.katalon.com/trankhoa0702/32/23869_2.png) [@trankhoa0702](https://forum.katalon.com/u/trankhoa0702)\
**Post date:** [February 11, 2020, 8:27am UTC](https://forum.katalon.com/t/my-testcase-is-failed-when-i-perform-run-remote-with-the-latest-firefox-browser/39700/1 "2020-02-11T08:27:05Z")

</div>

Hi all,  
Like the title, my test case is failed when I run it by Remote. Here is my Automation Setup:  
On Hub:  
java -jar selenium-server-standalone-3.7.1.jar -role hub  
On Node PC:  
ava -Dwebdriver.gecko.driver=“C:\geckodriver.exe” -jar selenium-server-standalone-3.7.1.jar -role webdriver -hub [http://192.168.1.3:4444/grid/register](http://192.168.1.3:4444/grid/register)  
I debug the TC and I see that Test case failed by step: WebUI.navigateToUrl(url)  
Here is the log pf error:  
020-02-11 15:00:46.556 ERROR c.k.k.core.keyword.internal.KeywordMain - ❌ Unable to navigate to ‘**’ (Root cause: com.kms.katalon.core.exception.StepFailedException: Unable to navigate to '**’  
at com.kms.katalon.core.webui.keyword.internal.WebUIKeywordMain.stepFailed(WebUIKeywordMain.groovy:64)  
at com.kms.katalon.core.webui.keyword.internal.WebUIKeywordMain.runKeyword(WebUIKeywordMain.groovy:26)  
at com.kms.katalon.core.webui.keyword.builtin.NavigateToUrlKeyword.navigateToUrl(NavigateToUrlKeyword.groovy:83)  
at com.kms.katalon.core.webui.keyword.builtin.NavigateToUrlKeyword.execute(NavigateToUrlKeyword.groovy:67)  
at com.kms.katalon.core.keyword.internal.KeywordExecutor.executeKeywordForPlatform(KeywordExecutor.groovy:56)  
at com.kms.katalon.core.webui.keyword.WebUiBuiltInKeywords.navigateToUrl(WebUiBuiltInKeywords.groovy:183)  
at com.kms.katalon.core.webui.keyword.WebUiBuiltInKeywords$navigateToUrl$1.call(Unknown Source)  
at Login to OV Web UI.run(Login to OV Web UI:10)  
at com.kms.katalon.core.main.ScriptEngine.run(ScriptEngine.java:194)  
at com.kms.katalon.core.main.ScriptEngine.runScriptAsRawText(ScriptEngine.java:119)  
at com.kms.katalon.core.main.TestCaseExecutor.runScript(TestCaseExecutor.java:337)  
at com.kms.katalon.core.main.TestCaseExecutor.doExecute(TestCaseExecutor.java:328)  
at com.kms.katalon.core.main.TestCaseExecutor.processExecutionPhase(TestCaseExecutor.java:307)  
at com.kms.katalon.core.main.TestCaseExecutor.accessMainPhase(TestCaseExecutor.java:299)  
at com.kms.katalon.core.main.TestCaseExecutor.execute(TestCaseExecutor.java:233)  
at com.kms.katalon.core.main.TestCaseMain.runTestCase(TestCaseMain.java:114)  
at com.kms.katalon.core.keyword.builtin.CallTestCaseKeyword$\_callTestCase\_closure1.doCall(CallTestCaseKeyword.groovy:59)  
at com.kms.katalon.core.keyword.builtin.CallTestCaseKeyword$\_callTestCase\_closure1.call(CallTestCaseKeyword.groovy)  
at com.kms.katalon.core.keyword.internal.KeywordMain.runKeyword(KeywordMain.groovy:68)  
at com.kms.katalon.core.keyword.builtin.CallTestCaseKeyword.callTestCase(CallTestCaseKeyword.groovy:81)  
at com.kms.katalon.core.keyword.builtin.CallTestCaseKeyword.execute(CallTestCaseKeyword.groovy:44)  
at com.kms.katalon.core.keyword.internal.KeywordExecutor.executeKeywordForPlatform(KeywordExecutor.groovy:56)  
at com.kms.katalon.core.keyword.BuiltinKeywords.callTestCase(BuiltinKeywords.groovy:334)  
at OVTEST-19028.run(OVTEST-19028:34)  
at com.kms.katalon.core.main.ScriptEngine.run(ScriptEngine.java:194)  
at com.kms.katalon.core.main.ScriptEngine.runScriptAsRawText(ScriptEngine.java:119)  
at com.kms.katalon.core.main.TestCaseExecutor.runScript(TestCaseExecutor.java:337)  
at com.kms.katalon.core.main.TestCaseExecutor.doExecute(TestCaseExecutor.java:328)  
at com.kms.katalon.core.main.TestCaseExecutor.processExecutionPhase(TestCaseExecutor.java:307)  
at com.kms.katalon.core.main.TestCaseExecutor.accessMainPhase(TestCaseExecutor.java:299)  
at com.kms.katalon.core.main.TestCaseExecutor.execute(TestCaseExecutor.java:233)  
at com.kms.katalon.core.main.TestSuiteExecutor.accessTestCaseMainPhase(TestSuiteExecutor.java:133)  
at com.kms.katalon.core.main.TestSuiteExecutor.accessTestSuiteMainPhase(TestSuiteExecutor.java:116)  
at com.kms.katalon.core.main.TestSuiteExecutor.execute(TestSuiteExecutor.java:83)  
at com.kms.katalon.core.main.TestCaseMain.startTestSuite(TestCaseMain.java:157)  
at com.kms.katalon.core.main.TestCaseMain$startTestSuite$0.call(Unknown Source)  
at TempTestSuite1581408039199.run(TempTestSuite1581408039199.groovy:35)  
Caused by: org.openqa.selenium.WebDriverException:  
Build info: version: ‘3.7.1’, revision: ‘8a0099a’, time: ‘2017-11-06T21:07:36.161Z’  
System info: host: ‘TVDKHOA’, ip: ‘192.168.70.154’, os.name: ‘Windows 7’, os.arch: ‘amd64’, os.version: ‘6.1’, java.version: ‘1.8.0\_181’  
Driver info: com.kms.katalon.selenium.driver.CRemoteWebDriver  
Capabilities {acceptInsecureCerts: false, browserName: firefox, browserVersion: 65.0, javascriptEnabled: true, moz:accessibilityChecks: false, moz:geckodriverVersion: 0.26.0, moz:headless: false, moz:processID: 2340, moz:profile: C:\Users\Administrator\AppD…, moz:shutdownTimeout: 60000, moz:useNonSpecCompliantPointerOrigin: false, moz:webdriverClick: true, pageLoadStrategy: normal, platform: WINDOWS, platformName: WINDOWS, platformVersion: 6.1, rotatable: false, setWindowRect: true, strictFileInteractability: false, timeouts: {implicit: 0, pageLoad: 300000, script: 30000}, unhandledPromptBehavior: dismiss and notify}  
Session ID: 713841d1-40ec-459d-95a7-b791b11be2b4  
at org.openqa.selenium.remote.http.W3CHttpResponseCodec.createException(W3CHttpResponseCodec.java:187)  
at org.openqa.selenium.remote.http.W3CHttpResponseCodec.decode(W3CHttpResponseCodec.java:122)  
at org.openqa.selenium.remote.http.W3CHttpResponseCodec.decode(W3CHttpResponseCodec.java:49)  
at org.openqa.selenium.remote.HttpCommandExecutor.execute(HttpCommandExecutor.java:164)  
at org.openqa.selenium.remote.RemoteWebDriver.execute(RemoteWebDriver.java:600)  
at com.kms.katalon.selenium.driver.CRemoteWebDriver.execute(CRemoteWebDriver.java:31)  
at org.openqa.selenium.remote.RemoteWebDriver.get(RemoteWebDriver.java:324)  
at org.openqa.selenium.remote.RemoteWebDriver$RemoteNavigation.to(RemoteWebDriver.java:911)  
at com.kms.katalon.core.webui.keyword.builtin.NavigateToUrlKeyword$\_navigateToUrl\_closure1.doCall(NavigateToUrlKeyword.groovy:81)  
at com.kms.katalon.core.webui.keyword.builtin.NavigateToUrlKeyword$\_navigateToUrl\_closure1.call(NavigateToUrlKeyword.groovy)  
at com.kms.katalon.core.webui.keyword.internal.WebUIKeywordMain.runKeyword(WebUIKeywordMain.groovy:20)  
at com.kms.katalon.core.webui.keyword.builtin.NavigateToUrlKeyword.navigateToUrl(NavigateToUrlKeyword.groovy:83)  
at com.kms.katalon.core.webui.keyword.builtin.NavigateToUrlKeyword.execute(NavigateToUrlKeyword.groovy:67)  
at com.kms.katalon.core.keyword.internal.KeywordExecutor.executeKeywordForPlatform(KeywordExecutor.groovy:56)  
at com.kms.katalon.core.webui.keyword.WebUiBuiltInKeywords.navigateToUrl(WebUiBuiltInKeywords.groovy:183)  
at com.kms.katalon.core.webui.keyword.WebUiBuiltInKeywords$navigateToUrl$1.call(Unknown Source)  
at Script1539053976941.run(Script1539053976941.groovy:10)  
at com.kms.katalon.core.main.ScriptEngine.run(ScriptEngine.java:194)  
at com.kms.katalon.core.main.ScriptEngine.runScriptAsRawText(ScriptEngine.java:119)  
at com.kms.katalon.core.main.TestCaseExecutor.runScript(TestCaseExecutor.java:337)  
at com.kms.katalon.core.main.TestCaseExecutor.doExecute(TestCaseExecutor.java:328)  
at com.kms.katalon.core.main.TestCaseExecutor.processExecutionPhase(TestCaseExecutor.java:307)  
at com.kms.katalon.core.main.TestCaseExecutor.accessMainPhase(TestCaseExecutor.java:299)  
at com.kms.katalon.core.main.TestCaseExecutor.execute(TestCaseExecutor.java:233)  
at com.kms.katalon.core.main.TestCaseMain.runTestCase(TestCaseMain.java:114)  
at com.kms.katalon.core.keyword.builtin.CallTestCaseKeyword$\_callTestCase\_closure1.doCall(CallTestCaseKeyword.groovy:59)  
at com.kms.katalon.core.keyword.builtin.CallTestCaseKeyword$\_callTestCase\_closure1.call(CallTestCaseKeyword.groovy)  
at com.kms.katalon.core.keyword.internal.KeywordMain.runKeyword(KeywordMain.groovy:68)  
at com.kms.katalon.core.keyword.builtin.CallTestCaseKeyword.callTestCase(CallTestCaseKeyword.groovy:81)  
at com.kms.katalon.core.keyword.builtin.CallTestCaseKeyword.execute(CallTestCaseKeyword.groovy:44)  
at com.kms.katalon.core.keyword.internal.KeywordExecutor.executeKeywordForPlatform(KeywordExecutor.groovy:56)  
at com.kms.katalon.core.keyword.BuiltinKeywords.callTestCase(BuiltinKeywords.groovy:334)  
at Script1527234284553.run(Script1527234284553.groovy:34)  
… 13 more  
)  
2020-02-11 15:00:46.566 ERROR c.k.katalon.core.main.TestCaseExecutor - ❌ Test Cases/Pages/General/Login to OV Web UI FAILED.  
Reason:  
com.kms.katalon.core.exception.StepFailedException: Unable to navigate to ‘\*\*\*\*\*\*\*\*\*\*\*\*\*\*\*\*\*\*\*\*\*\*\*\*\*\*\*\*’  
at com.kms.katalon.core.webui.keyword.internal.WebUIKeywordMain.stepFailed(WebUIKeywordMain.groovy:64)  
at com.kms.katalon.core.webui.keyword.internal.WebUIKeywordMain.runKeyword(WebUIKeywordMain.groovy:26)  
at com.kms.katalon.core.webui.keyword.builtin.NavigateToUrlKeyword.navigateToUrl(NavigateToUrlKeyword.groovy:83)  
at com.kms.katalon.core.webui.keyword.builtin.NavigateToUrlKeyword.execute(NavigateToUrlKeyword.groovy:67)  
at com.kms.katalon.core.keyword.internal.KeywordExecutor.executeKeywordForPlatform(KeywordExecutor.groovy:56)  
at com.kms.katalon.core.webui.keyword.WebUiBuiltInKeywords.navigateToUrl(WebUiBuiltInKeywords.groovy:183)  
at com.kms.katalon.core.webui.keyword.WebUiBuiltInKeywords$navigateToUrl$1.call(Unknown Source)  
at Login to OV Web UI.run(Login to OV Web UI:10)  
at com.kms.katalon.core.main.ScriptEngine.run(ScriptEngine.java:194)  
at com.kms.katalon.core.main.ScriptEngine.runScriptAsRawText(ScriptEngine.java:119)  
at com.kms.katalon.core.main.TestCaseExecutor.runScript(TestCaseExecutor.java:337)  
at com.kms.katalon.core.main.TestCaseExecutor.doExecute(TestCaseExecutor.java:328)  
at com.kms.katalon.core.main.TestCaseExecutor.processExecutionPhase(TestCaseExecutor.java:307)  
at com.kms.katalon.core.main.TestCaseExecutor.accessMainPhase(TestCaseExecutor.java:299)  
at com.kms.katalon.core.main.TestCaseExecutor.execute(TestCaseExecutor.java:233)  
at com.kms.katalon.core.main.TestCaseMain.runTestCase(TestCaseMain.java:114)  
at com.kms.katalon.core.keyword.builtin.CallTestCaseKeyword$\_callTestCase\_closure1.doCall(CallTestCaseKeyword.groovy:59)  
at com.kms.katalon.core.keyword.builtin.CallTestCaseKeyword$\_callTestCase\_closure1.call(CallTestCaseKeyword.groovy)  
at com.kms.katalon.core.keyword.internal.KeywordMain.runKeyword(KeywordMain.groovy:68)  
at com.kms.katalon.core.keyword.builtin.CallTestCaseKeyword.callTestCase(CallTestCaseKeyword.groovy:81)  
at com.kms.katalon.core.keyword.builtin.CallTestCaseKeyword.execute(CallTestCaseKeyword.groovy:44)  
at com.kms.katalon.core.keyword.internal.KeywordExecutor.executeKeywordForPlatform(KeywordExecutor.groovy:56)  
at com.kms.katalon.core.keyword.BuiltinKeywords.callTestCase(BuiltinKeywords.groovy:334)  
at OVTEST-19028.run(OVTEST-19028:34)  
at com.kms.katalon.core.main.ScriptEngine.run(ScriptEngine.java:194)  
at com.kms.katalon.core.main.ScriptEngine.runScriptAsRawText(ScriptEngine.java:119)  
at com.kms.katalon.core.main.TestCaseExecutor.runScript(TestCaseExecutor.java:337)  
at com.kms.katalon.core.main.TestCaseExecutor.doExecute(TestCaseExecutor.java:328)  
at com.kms.katalon.core.main.TestCaseExecutor.processExecutionPhase(TestCaseExecutor.java:307)  
at com.kms.katalon.core.main.TestCaseExecutor.accessMainPhase(TestCaseExecutor.java:299)  
at com.kms.katalon.core.main.TestCaseExecutor.execute(TestCaseExecutor.java:233)  
at com.kms.katalon.core.main.TestSuiteExecutor.accessTestCaseMainPhase(TestSuiteExecutor.java:133)  
at com.kms.katalon.core.main.TestSuiteExecutor.accessTestSuiteMainPhase(TestSuiteExecutor.java:116)  
at com.kms.katalon.core.main.TestSuiteExecutor.execute(TestSuiteExecutor.java:83)  
at com.kms.katalon.core.main.TestCaseMain.startTestSuite(TestCaseMain.java:157)  
at com.kms.katalon.core.main.TestCaseMain$startTestSuite$0.call(Unknown Source)  
at TempTestSuite1581408039199.run(TempTestSuite1581408039199.groovy:35)  
Caused by: org.openqa.selenium.WebDriverException:  
Build info: version: ‘3.7.1’, revision: ‘8a0099a’, time: ‘2017-11-06T21:07:36.161Z’  
System info: host: ‘TVDKHOA’, ip: ‘192.168.70.154’, os.name: ‘Windows 7’, os.arch: ‘amd64’, os.version: ‘6.1’, java.version: ‘1.8.0\_181’  
Driver info: com.kms.katalon.selenium.driver.CRemoteWebDriver  
Capabilities {acceptInsecureCerts: false, browserName: firefox, browserVersion: 65.0, javascriptEnabled: true, moz:accessibilityChecks: false, moz:geckodriverVersion: 0.26.0, moz:headless: false, moz:processID: 2340, moz:profile: C:\Users\Administrator\AppD…, moz:shutdownTimeout: 60000, moz:useNonSpecCompliantPointerOrigin: false, moz:webdriverClick: true, pageLoadStrategy: normal, platform: WINDOWS, platformName: WINDOWS, platformVersion: 6.1, rotatable: false, setWindowRect: true, strictFileInteractability: false, timeouts: {implicit: 0, pageLoad: 300000, script: 30000}, unhandledPromptBehavior: dismiss and notify}  
Session ID: 713841d1-40ec-459d-95a7-b791b11be2b4  
at org.openqa.selenium.remote.http.W3CHttpResponseCodec.createException(W3CHttpResponseCodec.java:187)  
at org.openqa.selenium.remote.http.W3CHttpResponseCodec.decode(W3CHttpResponseCodec.java:122)  
at org.openqa.selenium.remote.http.W3CHttpResponseCodec.decode(W3CHttpResponseCodec.java:49)  
at org.openqa.selenium.remote.HttpCommandExecutor.execute(HttpCommandExecutor.java:164)  
at org.openqa.selenium.remote.RemoteWebDriver.execute(RemoteWebDriver.java:600)  
at com.kms.katalon.selenium.driver.CRemoteWebDriver.execute(CRemoteWebDriver.java:31)  
at org.openqa.selenium.remote.RemoteWebDriver.get(RemoteWebDriver.java:324)  
at org.openqa.selenium.remote.RemoteWebDriver$RemoteNavigation.to(RemoteWebDriver.java:911)  
at com.kms.katalon.core.webui.keyword.builtin.NavigateToUrlKeyword$\_navigateToUrl\_closure1.doCall(NavigateToUrlKeyword.groovy:81)  
at com.kms.katalon.core.webui.keyword.builtin.NavigateToUrlKeyword$\_navigateToUrl\_closure1.call(NavigateToUrlKeyword.groovy)  
at com.kms.katalon.core.webui.keyword.internal.WebUIKeywordMain.runKeyword(WebUIKeywordMain.groovy:20)  
… 35 more

2020-02-11 15:00:46.573 INFO c.k.katalon.core.main.TestCaseExecutor - END CALL Test Cases/Pages/General/Login to OV Web UI  
2020-02-11 15:00:46.573 INFO c.k.katalon.core.main.TestCaseExecutor - --------------------  
2020-02-11 15:00:46.577 ERROR c.k.k.core.keyword.internal.KeywordMain - ❌ Unable to call Test Case ‘Test Cases/Pages/General/Login to OV Web UI’ (Root cause: com.kms.katalon.core.exception.StepFailedException: Call Test Case ‘Test Cases/Pages/General/Login to OV Web UI’ failed  
at com.kms.katalon.core.keyword.builtin.CallTestCaseKeyword$\_callTestCase\_closure1.doCall(CallTestCaseKeyword.groovy:63)  
at com.kms.katalon.core.keyword.builtin.CallTestCaseKeyword$\_callTestCase\_closure1.call(CallTestCaseKeyword.groovy)  
at com.kms.katalon.core.keyword.internal.KeywordMain.runKeyword(KeywordMain.groovy:68)  
at com.kms.katalon.core.keyword.builtin.CallTestCaseKeyword.callTestCase(CallTestCaseKeyword.groovy:81)  
at com.kms.katalon.core.keyword.builtin.CallTestCaseKeyword.execute(CallTestCaseKeyword.groovy:44)  
at com.kms.katalon.core.keyword.internal.KeywordExecutor.executeKeywordForPlatform(KeywordExecutor.groovy:56)  
at com.kms.katalon.core.keyword.BuiltinKeywords.callTestCase(BuiltinKeywords.groovy:334)  
at OVTEST-19028.run(OVTEST-19028:34)  
at com.kms.katalon.core.main.ScriptEngine.run(ScriptEngine.java:194)  
at com.kms.katalon.core.main.ScriptEngine.runScriptAsRawText(ScriptEngine.java:119)  
at com.kms.katalon.core.main.TestCaseExecutor.runScript(TestCaseExecutor.java:337)  
at com.kms.katalon.core.main.TestCaseExecutor.doExecute(TestCaseExecutor.java:328)  
at com.kms.katalon.core.main.TestCaseExecutor.processExecutionPhase(TestCaseExecutor.java:307)  
at com.kms.katalon.core.main.TestCaseExecutor.accessMainPhase(TestCaseExecutor.java:299)  
at com.kms.katalon.core.main.TestCaseExecutor.execute(TestCaseExecutor.java:233)  
at com.kms.katalon.core.main.TestSuiteExecutor.accessTestCaseMainPhase(TestSuiteExecutor.java:133)  
at com.kms.katalon.core.main.TestSuiteExecutor.accessTestSuiteMainPhase(TestSuiteExecutor.java:116)  
at com.kms.katalon.core.main.TestSuiteExecutor.execute(TestSuiteExecutor.java:83)  
at com.kms.katalon.core.main.TestCaseMain.startTestSuite(TestCaseMain.java:157)  
at com.kms.katalon.core.main.TestCaseMain$startTestSuite$0.call(Unknown Source)  
at TempTestSuite1581408039199.run(TempTestSuite1581408039199.groovy:35)  
Caused by: com.kms.katalon.core.exception.StepFailedException: Unable to navigate to ‘**’  
at com.kms.katalon.core.webui.keyword.internal.WebUIKeywordMain.stepFailed(WebUIKeywordMain.groovy:64)  
at com.kms.katalon.core.webui.keyword.internal.WebUIKeywordMain.runKeyword(WebUIKeywordMain.groovy:26)  
at com.kms.katalon.core.webui.keyword.builtin.NavigateToUrlKeyword.navigateToUrl(NavigateToUrlKeyword.groovy:83)  
at com.kms.katalon.core.webui.keyword.builtin.NavigateToUrlKeyword.execute(NavigateToUrlKeyword.groovy:67)  
at com.kms.katalon.core.keyword.internal.KeywordExecutor.executeKeywordForPlatform(KeywordExecutor.groovy:56)  
at com.kms.katalon.core.webui.keyword.WebUiBuiltInKeywords.navigateToUrl(WebUiBuiltInKeywords.groovy:183)  
at com.kms.katalon.core.webui.keyword.WebUiBuiltInKeywords$navigateToUrl$1.call(Unknown Source)  
at Login to OV Web UI.run(Login to OV Web UI:10)  
at com.kms.katalon.core.main.ScriptEngine.run(ScriptEngine.java:194)  
at com.kms.katalon.core.main.ScriptEngine.runScriptAsRawText(ScriptEngine.java:119)  
at com.kms.katalon.core.main.TestCaseExecutor.runScript(TestCaseExecutor.java:337)  
at com.kms.katalon.core.main.TestCaseExecutor.doExecute(TestCaseExecutor.java:328)  
at com.kms.katalon.core.main.TestCaseExecutor.processExecutionPhase(TestCaseExecutor.java:307)  
at com.kms.katalon.core.main.TestCaseExecutor.accessMainPhase(TestCaseExecutor.java:299)  
at com.kms.katalon.core.main.TestCaseExecutor.execute(TestCaseExecutor.java:233)  
at com.kms.katalon.core.main.TestCaseMain.runTestCase(TestCaseMain.java:114)  
at com.kms.katalon.core.keyword.builtin.CallTestCaseKeyword$\_callTestCase\_closure1.doCall(CallTestCaseKeyword.groovy:59)  
… 20 more  
Caused by: org.openqa.selenium.WebDriverException:  
Build info: version: ‘3.7.1’, revision: ‘8a0099a’, time: ‘2017-11-06T21:07:36.161Z’  
System info: host: ‘TVDKHOA’, ip: ‘192.168.70.154’, os.name: ‘Windows 7’, os.arch: ‘amd64’, os.version: ‘6.1’, java.version: ‘1.8.0\_181’  
Driver info: com.kms.katalon.selenium.driver.CRemoteWebDriver  
Capabilities {acceptInsecureCerts: false, browserName: firefox, browserVersion: 65.0, javascriptEnabled: true, moz:accessibilityChecks: false, moz:geckodriverVersion: 0.26.0, moz:headless: false, moz:processID: 2340, moz:profile: C:\Users\Administrator\AppD…, moz:shutdownTimeout: 60000, moz:useNonSpecCompliantPointerOrigin: false, moz:webdriverClick: true, pageLoadStrategy: normal, platform: WINDOWS, platformName: WINDOWS, platformVersion: 6.1, rotatable: false, setWindowRect: true, strictFileInteractability: false, timeouts: {implicit: 0, pageLoad: 300000, script: 30000}, unhandledPromptBehavior: dismiss and notify}  
Session ID: 713841d1-40ec-459d-95a7-b791b11be2b4  
at org.openqa.selenium.remote.http.W3CHttpResponseCodec.createException(W3CHttpResponseCodec.java:187)  
at org.openqa.selenium.remote.http.W3CHttpResponseCodec.decode(W3CHttpResponseCodec.java:122)  
at org.openqa.selenium.remote.http.W3CHttpResponseCodec.decode(W3CHttpResponseCodec.java:49)  
at org.openqa.selenium.remote.HttpCommandExecutor.execute(HttpCommandExecutor.java:164)  
at org.openqa.selenium.remote.RemoteWebDriver.execute(RemoteWebDriver.java:600)  
at com.kms.katalon.selenium.driver.CRemoteWebDriver.execute(CRemoteWebDriver.java:31)  
at org.openqa.selenium.remote.RemoteWebDriver.get(RemoteWebDriver.java:324)  
at org.openqa.selenium.remote.RemoteWebDriver$RemoteNavigation.to(RemoteWebDriver.java:911)  
at com.kms.katalon.core.webui.keyword.builtin.NavigateToUrlKeyword$\_navigateToUrl\_closure1.doCall(NavigateToUrlKeyword.groovy:81)  
at com.kms.katalon.core.webui.keyword.builtin.NavigateToUrlKeyword$\_navigateToUrl\_closure1.call(NavigateToUrlKeyword.groovy)  
at com.kms.katalon.core.webui.keyword.internal.WebUIKeywordMain.runKeyword(WebUIKeywordMain.groovy:20)  
… 35 more  
)  
2020-02-11 15:00:46.596 ERROR c.k.katalon.core.main.TestCaseExecutor - ❌ Test Cases/Sanity/Groups/OVTEST-19028 FAILED.  
Reason:  
com.kms.katalon.core.exception.StepFailedException: Call Test Case ‘Test Cases/Pages/General/Login to OV Web UI’ failed  
at com.kms.katalon.core.keyword.builtin.CallTestCaseKeyword$\_callTestCase\_closure1.doCall(CallTestCaseKeyword.groovy:63)  
at com.kms.katalon.core.keyword.builtin.CallTestCaseKeyword$\_callTestCase\_closure1.call(CallTestCaseKeyword.groovy)  
at com.kms.katalon.core.keyword.internal.KeywordMain.runKeyword(KeywordMain.groovy:68)  
at com.kms.katalon.core.keyword.builtin.CallTestCaseKeyword.callTestCase(CallTestCaseKeyword.groovy:81)  
at com.kms.katalon.core.keyword.builtin.CallTestCaseKeyword.execute(CallTestCaseKeyword.groovy:44)  
at com.kms.katalon.core.keyword.internal.KeywordExecutor.executeKeywordForPlatform(KeywordExecutor.groovy:56)  
at com.kms.katalon.core.keyword.BuiltinKeywords.callTestCase(BuiltinKeywords.groovy:334)  
at OVTEST-19028.run(OVTEST-19028:34)  
at com.kms.katalon.core.main.ScriptEngine.run(ScriptEngine.java:194)  
at com.kms.katalon.core.main.ScriptEngine.runScriptAsRawText(ScriptEngine.java:119)  
at com.kms.katalon.core.main.TestCaseExecutor.runScript(TestCaseExecutor.java:337)  
at com.kms.katalon.core.main.TestCaseExecutor.doExecute(TestCaseExecutor.java:328)  
at com.kms.katalon.core.main.TestCaseExecutor.processExecutionPhase(TestCaseExecutor.java:307)  
at com.kms.katalon.core.main.TestCaseExecutor.accessMainPhase(TestCaseExecutor.java:299)  
at com.kms.katalon.core.main.TestCaseExecutor.execute(TestCaseExecutor.java:233)  
at com.kms.katalon.core.main.TestSuiteExecutor.accessTestCaseMainPhase(TestSuiteExecutor.java:133)  
at com.kms.katalon.core.main.TestSuiteExecutor.accessTestSuiteMainPhase(TestSuiteExecutor.java:116)  
at com.kms.katalon.core.main.TestSuiteExecutor.execute(TestSuiteExecutor.java:83)  
at com.kms.katalon.core.main.TestCaseMain.startTestSuite(TestCaseMain.java:157)  
at com.kms.katalon.core.main.TestCaseMain$startTestSuite$0.call(Unknown Source)  
at TempTestSuite1581408039199.run(TempTestSuite1581408039199.groovy:35)  
Caused by: com.kms.katalon.core.exception.StepFailedException: Unable to navigate to '**’  
at com.kms.katalon.core.webui.keyword.internal.WebUIKeywordMain.stepFailed(WebUIKeywordMain.groovy:64)  
at com.kms.katalon.core.webui.keyword.internal.WebUIKeywordMain.runKeyword(WebUIKeywordMain.groovy:26)  
at com.kms.katalon.core.webui.keyword.builtin.NavigateToUrlKeyword.navigateToUrl(NavigateToUrlKeyword.groovy:83)  
at com.kms.katalon.core.webui.keyword.builtin.NavigateToUrlKeyword.execute(NavigateToUrlKeyword.groovy:67)  
at com.kms.katalon.core.keyword.internal.KeywordExecutor.executeKeywordForPlatform(KeywordExecutor.groovy:56)  
at com.kms.katalon.core.webui.keyword.WebUiBuiltInKeywords.navigateToUrl(WebUiBuiltInKeywords.groovy:183)  
at com.kms.katalon.core.webui.keyword.WebUiBuiltInKeywords$navigateToUrl$1.call(Unknown Source)  
at Login to OV Web UI.run(Login to OV Web UI:10)  
at com.kms.katalon.core.main.ScriptEngine.run(ScriptEngine.java:194)  
at com.kms.katalon.core.main.ScriptEngine.runScriptAsRawText(ScriptEngine.java:119)  
at com.kms.katalon.core.main.TestCaseExecutor.runScript(TestCaseExecutor.java:337)  
at com.kms.katalon.core.main.TestCaseExecutor.doExecute(TestCaseExecutor.java:328)  
at com.kms.katalon.core.main.TestCaseExecutor.processExecutionPhase(TestCaseExecutor.java:307)  
at com.kms.katalon.core.main.TestCaseExecutor.accessMainPhase(TestCaseExecutor.java:299)  
at com.kms.katalon.core.main.TestCaseExecutor.execute(TestCaseExecutor.java:233)  
at com.kms.katalon.core.main.TestCaseMain.runTestCase(TestCaseMain.java:114)  
at com.kms.katalon.core.keyword.builtin.CallTestCaseKeyword$\_callTestCase\_closure1.doCall(CallTestCaseKeyword.groovy:59)  
… 20 more  
Caused by: org.openqa.selenium.WebDriverException:  
Build info: version: ‘3.7.1’, revision: ‘8a0099a’, time: ‘2017-11-06T21:07:36.161Z’  
System info: host: ‘TVDKHOA’, ip: ‘192.168.70.154’, os.name: ‘Windows 7’, os.arch: ‘amd64’, os.version: ‘6.1’, java.version: ‘1.8.0\_181’  
Driver info: com.kms.katalon.selenium.driver.CRemoteWebDriver  
Capabilities {acceptInsecureCerts: false, browserName: firefox, browserVersion: 65.0, javascriptEnabled: true, moz:accessibilityChecks: false, moz:geckodriverVersion: 0.26.0, moz:headless: false, moz:processID: 2340, moz:profile: C:\Users\Administrator\AppD…, moz:shutdownTimeout: 60000, moz:useNonSpecCompliantPointerOrigin: false, moz:webdriverClick: true, pageLoadStrategy: normal, platform: WINDOWS, platformName: WINDOWS, platformVersion: 6.1, rotatable: false, setWindowRect: true, strictFileInteractability: false, timeouts: {implicit: 0, pageLoad: 300000, script: 30000}, unhandledPromptBehavior: dismiss and notify}  
Session ID: 713841d1-40ec-459d-95a7-b791b11be2b4  
at org.openqa.selenium.remote.http.W3CHttpResponseCodec.createException(W3CHttpResponseCodec.java:187)  
at org.openqa.selenium.remote.http.W3CHttpResponseCodec.decode(W3CHttpResponseCodec.java:122)  
at org.openqa.selenium.remote.http.W3CHttpResponseCodec.decode(W3CHttpResponseCodec.java:49)  
at org.openqa.selenium.remote.HttpCommandExecutor.execute(HttpCommandExecutor.java:164)  
at org.openqa.selenium.remote.RemoteWebDriver.execute(RemoteWebDriver.java:600)  
at com.kms.katalon.selenium.driver.CRemoteWebDriver.execute(CRemoteWebDriver.java:31)  
at org.openqa.selenium.remote.RemoteWebDriver.get(RemoteWebDriver.java:324)  
at org.openqa.selenium.remote.RemoteWebDriver$RemoteNavigation.to(RemoteWebDriver.java:911)  
at com.kms.katalon.core.webui.keyword.builtin.NavigateToUrlKeyword$\_navigateToUrl\_closure1.doCall(NavigateToUrlKeyword.groovy:81)  
at com.kms.katalon.core.webui.keyword.builtin.NavigateToUrlKeyword$\_navigateToUrl\_closure1.call(NavigateToUrlKeyword.groovy)  
at com.kms.katalon.core.webui.keyword.internal.WebUIKeywordMain.runKeyword(WebUIKeywordMain.groovy:20)  
… 35 more

---

<div class="post-metadata">

**Author:** ![Timo\_Kuisma1](https://dub1.discourse-cdn.com/katalon/user_avatar/forum.katalon.com/timo_kuisma1/32/16103_2.png) [@Timo\_Kuisma1](https://forum.katalon.com/u/Timo_Kuisma1)\
**Post date:** [February 11, 2020, 11:38am UTC](https://forum.katalon.com/t/my-testcase-is-failed-when-i-perform-run-remote-with-the-latest-firefox-browser/39700/2 "2020-02-11T11:38:13Z")

</div>

hi,

check that your driver & browser versions are match

---

<div class="post-metadata">

**Author:** ![trankhoa0702](https://dub1.discourse-cdn.com/katalon/user_avatar/forum.katalon.com/trankhoa0702/32/23869_2.png) [@trankhoa0702](https://forum.katalon.com/u/trankhoa0702)\
**Post date:** [February 12, 2020, 8:45am UTC](https://forum.katalon.com/t/my-testcase-is-failed-when-i-perform-run-remote-with-the-latest-firefox-browser/39700/3 "2020-02-12T08:45:29Z")

</div>

Hi Timo\_Kuisma1  
Ex: I create a Firefox profile with name is automation in my node PC. How to setup it in Katalon

 ![image](https://europe1.discourse-cdn.com/katalon/original/2X/5/5184a82a90ded1921a7145de778155e22b3e31ce.png)

---

<div class="post-metadata">

**Author:** ![Timo\_Kuisma1](https://dub1.discourse-cdn.com/katalon/user_avatar/forum.katalon.com/timo_kuisma1/32/16103_2.png) [@Timo\_Kuisma1](https://forum.katalon.com/u/Timo_Kuisma1)\
**Post date:** [February 12, 2020, 3:02pm UTC](https://forum.katalon.com/t/my-testcase-is-failed-when-i-perform-run-remote-with-the-latest-firefox-browser/39700/4 "2020-02-12T15:02:19Z")

</div>

hi,check this

> [@How to set Firefox -profile in Katalon Studio 6.2.1](http://forum.katalon.com/t/how-to-set-firefox-profile-in-katalon-studio-6-2-1/35351/2):
>
> This issue has been fixed by my team mate (Dennis) by doing the following - this solution combines a Global Variable in a Katalon Profile with a custom keyword. Add a new variable in a profile - this is done in your Katalon project, go to Tests Explorer under Profiles \> Default and set the following: Name = G\_FFProfile Value = (this is the name of your firefox profile containing your certs, extensions, bookmarks, etc. that you need to run your tests)I created a new firefox profile and called…

---

<div class="post-metadata">

**Author:** ![trankhoa0702](https://dub1.discourse-cdn.com/katalon/user_avatar/forum.katalon.com/trankhoa0702/32/23869_2.png) [@trankhoa0702](https://forum.katalon.com/u/trankhoa0702)\
**Post date:** [February 13, 2020, 7:52am UTC](https://forum.katalon.com/t/my-testcase-is-failed-when-i-perform-run-remote-with-the-latest-firefox-browser/39700/5 "2020-02-13T07:52:25Z")

</div>

Hi Timo\_Kuisma1,  
I tried this solution and it works Ok on My PC. But when I use the BrowserType=Remote. I can’t start a session on Node PC. This solution didn’t work on Remote mode
